{"text_format":"1","workbook":"xlsx","n_sheets":10,"sheets":["Clinic","Physician 1","Physician 2","Physician 3","Physician 4","Physician 5","Physician 6","Physician 7","Physician 8","Corrections for HA"],"not_rendered":{"charts":0,"images":0,"macros":1,"external_links":0,"defined_names":0,"comments":0,"pivot_tables":0},"unopened":[],"bounds":{"document_bytes":16777216,"sheet_cells":100000,"rows_first":2000,"rows_last":500,"rows_between":2000,"halvings":0,"cell_chars":16384,"cell_head_chars":4096},"cells_cut":0,"cells_raw":0,"read":"whole","date_system":"1900"}

{"sheet":"Clinic","index":0,"n_rows":85,"n_cols":6,"rows_kept":85,"cut":false,"hidden":false,"merged":[[6,1,6,2],[6,3,6,4],[7,1,9,2],[7,3,9,4]]}
[]
[null,"[Clinic Name]"]
[null,"Payee Number:"]
[null,"Facility Code:"]
[null,"Fiscal Quarter ","Jan - Mar"]
[null,"Year:",2021]
[null,"Total Included & Direct Hours\nHours",null,"Total Included QI Hours\nHours"]
[null,{"$f":"Table3[[#Totals],[Indirect & Direct Hours]]+Table337[[#Totals],[Indirect & Direct Hours]]+Table338[[#Totals],[Indirect & Direct Hours]]+Table339[[#Totals],[Indirect & Direct Hours]]+Table331[[#Totals],[Indirect & Direct Hours]]+Table33132[[#Totals],[Indirect & Direct Hours]]+Table3313234[[#Totals],[Indirect & Direct Hours]]+Table331323435[[#Totals],[Indirect & Direct Hours]]","v":0},null,{"$f":"Table3[[#Totals],[Included QI Hours]]+Table337[[#Totals],[Included QI Hours]]+Table338[[#Totals],[Included QI Hours]]+Table339[[#Totals],[Included QI Hours]]+Table331[[#Totals],[Included QI Hours]]+Table33132[[#Totals],[Included QI Hours]]+Table3313234[[#Totals],[Included QI Hours]]+Table331323435[[#Totals],[Included QI Hours]]","v":0}]
[]
[]
[]
[]
[null,{"$f":"'Physician 1'!$C$3","v":0},{"$f":"'Physician 1'!$B$2","v":"[Physician Name]"}]
[]
[null,"Months","Indirect & Direct Hours","Included QI Hours","Annual Rate","Disbursement Amount"]
[null,{"$f":"IF($C$5=\"Jan - Mar\",\"January\",IF($C$5=\"Apr - June\",\"April\",IF($C$5=\"July - Sept\",\"July\",IF($C$5=\"Oct - Dec\",\"October\"))))","v":"January"},{"$f":"'Physician 1'!$G$35","v":0},{"$f":"'Physician 1'!$G$36","v":0},{"$f":"'Physician 1'!$C$4","v":0},{"$f":"'Physician 1'!$C$5/3","v":0}]
[null,{"$f":"IF($C$5=\"Jan - Mar\",\"February\",IF($C$5=\"Apr - June\",\"May\",IF($C$5=\"July - Sept\",\"August\",IF($C$5=\"Oct - Dec\",\"November\"))))","v":"February"},{"$f":"'Physician 1'!$G$75","v":0},{"$f":"'Physician 1'!$G$76","v":0},{"$f":"'Physician 1'!$C$4","v":0},{"$f":"'Physician 1'!$C$5/3","v":0}]
[null,{"$f":"IF($C$5=\"Jan - Mar\",\"March\",IF($C$5=\"Apr - June\",\"June\",IF($C$5=\"July - Sept\",\"September\",IF($C$5=\"Oct - Dec\",\"December\"))))","v":"March"},{"$f":"'Physician 1'!$G$115","v":0},{"$f":"'Physician 1'!$G$116","v":0},{"$f":"'Physician 1'!$C$4","v":0},{"$f":"'Physician 1'!$C$5/3","v":0}]
[null,"Total",{"$f":"SUBTOTAL(109,Table3[Indirect & Direct Hours])","v":0},{"$f":"SUBTOTAL(109,Table3[Included QI Hours])","v":0},{"$f":"$E$18","v":0},{"$f":"SUBTOTAL(109,Table3[Disbursement Amount])","v":0}]
[]
[]
[null,{"$f":"'Physician 2'!$C$3","v":0},{"$f":"'Physician 2'!$B$2","v":"[Physician Name]"}]
[]
[null,"Months","Indirect & Direct Hours","Included QI Hours","Annual Rate","Disbursement Amount"]
[null,{"$f":"IF($C$5=\"Jan - Mar\",\"January\",IF($C$5=\"Apr - June\",\"April\",IF($C$5=\"July - Sept\",\"July\",IF($C$5=\"Oct - Dec\",\"October\"))))","v":"January"},{"$f":"'Physician 2'!$G$35","v":0},{"$f":"'Physician 2'!$G$36","v":0},{"$f":"'Physician 2'!$C$4","v":0},{"$f":"'Physician 2'!$C$5/3","v":0}]
[null,{"$f":"IF($C$5=\"Jan - Mar\",\"February\",IF($C$5=\"Apr - June\",\"May\",IF($C$5=\"July - Sept\",\"August\",IF($C$5=\"Oct - Dec\",\"November\"))))","v":"February"},{"$f":"'Physician 2'!$G$75","v":0},{"$f":"'Physician 2'!$G$76","v":0},{"$f":"'Physician 2'!$C$4","v":0},{"$f":"'Physician 2'!$C$5/3","v":0}]
[null,{"$f":"IF($C$5=\"Jan - Mar\",\"March\",IF($C$5=\"Apr - June\",\"June\",IF($C$5=\"July - Sept\",\"September\",IF($C$5=\"Oct - Dec\",\"December\"))))","v":"March"},{"$f":"'Physician 2'!$G$115","v":0},{"$f":"'Physician 2'!$G$116","v":0},{"$f":"'Physician 2'!$C$4","v":0},{"$f":"'Physician 2'!$C$5/3","v":0}]
[null,"Total",{"$f":"SUBTOTAL(109,Table337[Indirect & Direct Hours])","v":0},{"$f":"SUBTOTAL(109,Table337[Included QI Hours])","v":0},{"$f":"$E$25","v":0},{"$f":"SUBTOTAL(109,Table337[Disbursement Amount])","v":0}]
[]
[]
[null,{"$f":"'Physician 3'!$C$3","v":0},{"$f":"'Physician 3'!$B$2","v":"[Physician Name]"}]
[]
[null,"Months","Indirect & Direct Hours","Included QI Hours","Annual Rate","Disbursement Amount"]
[null,{"$f":"IF($C$5=\"Jan - Mar\",\"January\",IF($C$5=\"Apr - June\",\"April\",IF($C$5=\"July - Sept\",\"July\",IF($C$5=\"Oct - Dec\",\"October\"))))","v":"January"},{"$f":"'Physician 3'!$G$35","v":0},{"$f":"'Physician 3'!$G$36","v":0},{"$f":"'Physician 3'!$C$4","v":0},{"$f":"'Physician 3'!$C$5/3","v":0}]
[null,{"$f":"IF($C$5=\"Jan - Mar\",\"February\",IF($C$5=\"Apr - June\",\"May\",IF($C$5=\"July - Sept\",\"August\",IF($C$5=\"Oct - Dec\",\"November\"))))","v":"February"},{"$f":"'Physician 3'!$G$75","v":0},{"$f":"'Physician 3'!$G$76","v":0},{"$f":"'Physician 3'!$C$4","v":0},{"$f":"'Physician 3'!$C$5/3","v":0}]
[null,{"$f":"IF($C$5=\"Jan - Mar\",\"March\",IF($C$5=\"Apr - June\",\"June\",IF($C$5=\"July - Sept\",\"September\",IF($C$5=\"Oct - Dec\",\"December\"))))","v":"March"},{"$f":"'Physician 3'!$G$115","v":0},{"$f":"'Physician 3'!$G$116","v":0},{"$f":"'Physician 3'!$C$4","v":0},{"$f":"'Physician 3'!$C$5/3","v":0}]
[null,"Total",{"$f":"SUBTOTAL(109,Table338[Indirect & Direct Hours])","v":0},{"$f":"SUBTOTAL(109,Table338[Included QI Hours])","v":0},{"$f":"SUBTOTAL(104,Table338[Annual Rate])","v":0},{"$f":"SUBTOTAL(109,Table338[Disbursement Amount])","v":0}]
[]
[]
[null,{"$f":"'Physician 4'!$C$3","v":0},{"$f":"'Physician 4'!$B$2","v":"[Physician Name]"}]
[]
[null,"Months","Indirect & Direct Hours","Included QI Hours","Annual Rate","Disbursement Amount"]
[null,{"$f":"IF($C$5=\"Jan - Mar\",\"January\",IF($C$5=\"Apr - June\",\"April\",IF($C$5=\"July - Sept\",\"July\",IF($C$5=\"Oct - Dec\",\"October\"))))","v":"January"},{"$f":"'Physician 4'!$G$35","v":0},{"$f":"'Physician 4'!$G$36","v":0},{"$f":"'Physician 4'!$C$4","v":0},{"$f":"'Physician 4'!$C$5/3","v":0}]
[null,{"$f":"IF($C$5=\"Jan - Mar\",\"February\",IF($C$5=\"Apr - June\",\"May\",IF($C$5=\"July - Sept\",\"August\",IF($C$5=\"Oct - Dec\",\"November\"))))","v":"February"},{"$f":"'Physician 4'!$G$75","v":0},{"$f":"'Physician 4'!$G$76","v":0},{"$f":"'Physician 4'!$C$4","v":0},{"$f":"'Physician 4'!$C$5/3","v":0}]
[null,{"$f":"IF($C$5=\"Jan - Mar\",\"March\",IF($C$5=\"Apr - June\",\"June\",IF($C$5=\"July - Sept\",\"September\",IF($C$5=\"Oct - Dec\",\"December\"))))","v":"March"},{"$f":"'Physician 4'!$G$115","v":0},{"$f":"'Physician 4'!$G$116","v":0},{"$f":"'Physician 4'!$C$4","v":0},{"$f":"'Physician 4'!$C$5/3","v":0}]
[null,"Total",{"$f":"SUBTOTAL(109,Table339[Indirect & Direct Hours])","v":0},{"$f":"SUBTOTAL(109,Table339[Included QI Hours])","v":0},{"$f":"SUBTOTAL(104,Table339[Annual Rate])","v":0},{"$f":"SUBTOTAL(109,Table339[Disbursement Amount])","v":0}]
[]
[]
[null,{"$f":"'Physician 5'!$C$3","v":0},{"$f":"'Physician 5'!$B$2","v":"[Physician Name]"}]
[]
[null,"Months","Indirect & Direct Hours","Included QI Hours","Annual Rate","Disbursement Amount"]
[null,{"$f":"IF($C$5=\"Jan - Mar\",\"January\",IF($C$5=\"Apr - June\",\"April\",IF($C$5=\"July - Sept\",\"July\",IF($C$5=\"Oct - Dec\",\"October\"))))","v":"January"},{"$f":"'Physician 5'!$G$35","v":0},{"$f":"'Physician 5'!$G$36","v":0},{"$f":"'Physician 5'!$C$4","v":0},{"$f":"'Physician 5'!$C$5/3","v":0}]
[null,{"$f":"IF($C$5=\"Jan - Mar\",\"February\",IF($C$5=\"Apr - June\",\"May\",IF($C$5=\"July - Sept\",\"August\",IF($C$5=\"Oct - Dec\",\"November\"))))","v":"February"},{"$f":"'Physician 5'!$G$75","v":0},{"$f":"'Physician 5'!$G$76","v":0},{"$f":"'Physician 5'!$C$4","v":0},{"$f":"'Physician 5'!$C$5/3","v":0}]
[null,{"$f":"IF($C$5=\"Jan - Mar\",\"March\",IF($C$5=\"Apr - June\",\"June\",IF($C$5=\"July - Sept\",\"September\",IF($C$5=\"Oct - Dec\",\"December\"))))","v":"March"},{"$f":"'Physician 5'!$G$115","v":0},{"$f":"'Physician 5'!$G$116","v":0},{"$f":"'Physician 5'!$C$4","v":0},{"$f":"'Physician 5'!$C$5/3","v":0}]
[null,"Total",{"$f":"SUBTOTAL(109,Table331[Indirect & Direct Hours])","v":0},{"$f":"SUBTOTAL(109,Table331[Included QI Hours])","v":0},{"$f":"SUBTOTAL(104,Table331[Annual Rate])","v":0},{"$f":"SUBTOTAL(109,Table331[Disbursement Amount])","v":0}]
[]
[]
[]
[null,{"$f":"'Physician 6'!$C$3","v":0},{"$f":"'Physician 6'!$B$2","v":"[Physician Name]"}]
[]
[null,"Months","Indirect & Direct Hours","Included QI Hours","Annual Rate","Disbursement Amount"]
[null,{"$f":"IF($C$5=\"Jan - Mar\",\"January\",IF($C$5=\"Apr - June\",\"April\",IF($C$5=\"July - Sept\",\"July\",IF($C$5=\"Oct - Dec\",\"October\"))))","v":"January"},{"$f":"'Physician 6'!$G$35","v":0},{"$f":"'Physician 6'!$G$36","v":0},{"$f":"'Physician 6'!$C$4","v":0},{"$f":"'Physician 6'!$C$5/3","v":0}]
[null,{"$f":"IF($C$5=\"Jan - Mar\",\"February\",IF($C$5=\"Apr - June\",\"May\",IF($C$5=\"July - Sept\",\"August\",IF($C$5=\"Oct - Dec\",\"November\"))))","v":"February"},{"$f":"'Physician 6'!$G$75","v":0},{"$f":"'Physician 6'!$G$76","v":0},{"$f":"'Physician 6'!$C$4","v":0},{"$f":"'Physician 6'!$C$5/3","v":0}]
[null,{"$f":"IF($C$5=\"Jan - Mar\",\"March\",IF($C$5=\"Apr - June\",\"June\",IF($C$5=\"July - Sept\",\"September\",IF($C$5=\"Oct - Dec\",\"December\"))))","v":"March"},{"$f":"'Physician 6'!$G$115","v":0},{"$f":"'Physician 6'!$G$116","v":0},{"$f":"'Physician 6'!$C$4","v":0},{"$f":"'Physician 6'!$C$5/3","v":0}]
[null,"Total",{"$f":"SUBTOTAL(109,Table33132[Indirect & Direct Hours])","v":0},{"$f":"SUBTOTAL(109,Table33132[Included QI Hours])","v":0},{"$f":"SUBTOTAL(109,Table33132[Annual Rate])","v":0},{"$f":"SUBTOTAL(109,Table33132[Disbursement Amount])","v":0}]
[]
[]
[]
[null,{"$f":"'Physician 7'!$C$3","v":0},{"$f":"'Physician 7'!$B$2","v":"[Physician Name]"}]
[]
[null,"Months","Indirect & Direct Hours","Included QI Hours","Annual Rate","Disbursement Amount"]
[null,{"$f":"IF($C$5=\"Jan - Mar\",\"January\",IF($C$5=\"Apr - June\",\"April\",IF($C$5=\"July - Sept\",\"July\",IF($C$5=\"Oct - Dec\",\"October\"))))","v":"January"},{"$f":"'Physician 7'!$G$35","v":0},{"$f":"'Physician 7'!$G$36","v":0},{"$f":"'Physician 7'!$C$4","v":0},{"$f":"'Physician 7'!$C$5/3","v":0}]
[null,{"$f":"IF($C$5=\"Jan - Mar\",\"February\",IF($C$5=\"Apr - June\",\"May\",IF($C$5=\"July - Sept\",\"August\",IF($C$5=\"Oct - Dec\",\"November\"))))","v":"February"},{"$f":"'Physician 7'!$G$75","v":0},{"$f":"'Physician 7'!$G$76","v":0},{"$f":"'Physician 7'!$C$4","v":0},{"$f":"'Physician 7'!$C$5/3","v":0}]
[null,{"$f":"IF($C$5=\"Jan - Mar\",\"March\",IF($C$5=\"Apr - June\",\"June\",IF($C$5=\"July - Sept\",\"September\",IF($C$5=\"Oct - Dec\",\"December\"))))","v":"March"},{"$f":"'Physician 7'!$G$115","v":0},{"$f":"'Physician 7'!$G$116","v":0},{"$f":"'Physician 7'!$C$4","v":0},{"$f":"'Physician 7'!$C$5/3","v":0}]
[null,"Total",{"$f":"SUBTOTAL(109,Table3313234[Indirect & Direct Hours])","v":0},{"$f":"SUBTOTAL(109,Table3313234[Included QI Hours])","v":0},{"$f":"SUBTOTAL(109,Table3313234[Annual Rate])","v":0},{"$f":"SUBTOTAL(109,Table3313234[Disbursement Amount])","v":0}]
[]
[]
[]
[null,{"$f":"'Physician 8'!$C$3","v":0},{"$f":"'Physician 8'!$B$2","v":"[Physician Name]"}]
[]
[null,"Months","Indirect & Direct Hours","Included QI Hours","Annual Rate","Disbursement Amount"]
[null,{"$f":"IF($C$5=\"Jan - Mar\",\"January\",IF($C$5=\"Apr - June\",\"April\",IF($C$5=\"July - Sept\",\"July\",IF($C$5=\"Oct - Dec\",\"October\"))))","v":"January"},{"$f":"'Physician 8'!$G$35","v":0},{"$f":"'Physician 8'!$G$36","v":0},{"$f":"'Physician 8'!$C$4","v":0},{"$f":"'Physician 8'!$C$5/3","v":0}]
[null,{"$f":"IF($C$5=\"Jan - Mar\",\"February\",IF($C$5=\"Apr - June\",\"May\",IF($C$5=\"July - Sept\",\"August\",IF($C$5=\"Oct - Dec\",\"November\"))))","v":"February"},{"$f":"'Physician 8'!$G$75","v":0},{"$f":"'Physician 8'!$G$76","v":0},{"$f":"'Physician 8'!$C$4","v":0},{"$f":"'Physician 8'!$C$5/3","v":0}]
[null,{"$f":"IF($C$5=\"Jan - Mar\",\"March\",IF($C$5=\"Apr - June\",\"June\",IF($C$5=\"July - Sept\",\"September\",IF($C$5=\"Oct - Dec\",\"December\"))))","v":"March"},{"$f":"'Physician 8'!$G$115","v":0},{"$f":"'Physician 8'!$G$116","v":0},{"$f":"'Physician 8'!$C$4","v":0},{"$f":"'Physician 8'!$C$5/3","v":0}]
[null,"Total",{"$f":"SUBTOTAL(109,Table331323435[Indirect & Direct Hours])","v":0},{"$f":"SUBTOTAL(109,Table331323435[Included QI Hours])","v":0},{"$f":"SUBTOTAL(109,Table331323435[Annual Rate])","v":0},{"$f":"SUBTOTAL(109,Table331323435[Disbursement Amount])","v":0}]

{"sheet":"Physician 1","index":1,"n_rows":120,"n_cols":8,"rows_kept":120,"cut":false,"hidden":false,"merged":[]}
[]
[null,"[Physician Name]"]
[null,"Practitioner #:",0]
[null,"Annual Rate: ",0]
[null,"Qrt. Disbursement: ",0]
[null,null,"Jan - Mar"]
[null,"Total Contract \nHours","Total Included \nQI Hours","Excluded Contract \nHours"]
[null,{"$f":"G35+G75+G115","v":0},{"$f":"G36+G76+G116","v":0},{"$f":"G37+G77+G117","v":0},null,null,null,"Totals"]
[]
[null,{"$f":"IF(Clinic!C5=\"Jan - Mar\", \"January\", IF(Clinic!C5= \"Apr - June\", \"April\", IF(Clinic!C5=\"July - Sept\", \"July\", IF(Clinic!C5=\" Oct - Dec\", \"October\"))))","v":"January"},{"$f":"Clinic!C6","v":2021},{"$f":"DATE(YEAR(B13),MONTH(DATEVALUE(B10&\"1\")),1)","v":"1900-01-01"},null,null,null,"Month1"]
[]
[null,"Date (YYYY-MM-DD)","Day ","Type of Care","Start Time AM/PM","End Time AM/PM","Duration","FALSE/TRUE"]
[null,null,{"$f":"IF(B13=\"\", \"\", B13)","v":""},null,null,null,null,{"$f":"IF( B13 > $D$10+14, SUMIFS($G$13:G13, $D$13:D13,\"Direct/Indirect/Clinical Administration\", $B$13:B13,\">\"&$D$10 + 14) + ((IF(SUMIF(Table13[Type of Care], \"QI\", Table13[Duration])>= 4, 4,IF(SUMIF(Table13[Type of Care], \"QI\", Table13[Duration])<= 3, SUMIF(Table13[Type of Care], \"QI\", Table13[Duration]), 0))))  > 90, SUMIFS($G$13:G13, $D$13:D13,\"Direct/Indirect/Clinical Administration\",  $B$13:B13,\"<=\"&$D$10 + 14)+ ((IF(SUMIF(Table13[Type of Care], \"QI\", Table13[Duration])>= 4, 4,IF(SUMIF(Table13[Type of Care], \"QI\", Table13[Duration])<= 3, SUMIF(Table13[Type of Care], \"QI\", Table13[Duration]), 0))))> 90)","v":false}]
[null,null,{"$f":"IF(B14=\"\", \"\", B14)","v":""},null,null,null,null,{"$f":"IF( B14 > $D$10+14, SUMIFS($G$13:G14, $D$13:D14,\"Direct/Indirect/Clinical Administration\", $B$13:B14,\">\"&$D$10 + 14) + ((IF(SUMIF(Table13[Type of Care], \"QI\", Table13[Duration])>= 4, 4,IF(SUMIF(Table13[Type of Care], \"QI\", Table13[Duration])<= 3, SUMIF(Table13[Type of Care], \"QI\", Table13[Duration]), 0))))  > 90, SUMIFS($G$13:G14, $D$13:D14,\"Direct/Indirect/Clinical Administration\",  $B$13:B14,\"<=\"&$D$10 + 14)+ ((IF(SUMIF(Table13[Type of Care], \"QI\", Table13[Duration])>= 4, 4,IF(SUMIF(Table13[Type of Care], \"QI\", Table13[Duration])<= 3, SUMIF(Table13[Type of Care], \"QI\", Table13[Duration]), 0))))> 90)","v":false}]
[null,null,"",null,null,null,null,{"$f":"IF( B15 > $D$10+14, SUMIFS($G$13:G15, $D$13:D15,\"Direct/Indirect/Clinical Administration\", $B$13:B15,\">\"&$D$10 + 14) + ((IF(SUMIF(Table13[Type of Care], \"QI\", Table13[Duration])>= 4, 4,IF(SUMIF(Table13[Type of Care], \"QI\", Table13[Duration])<= 3, SUMIF(Table13[Type of Care], \"QI\", Table13[Duration]), 0))))  > 90, SUMIFS($G$13:G15, $D$13:D15,\"Direct/Indirect/Clinical Administration\",  $B$13:B15,\"<=\"&$D$10 + 14)+ ((IF(SUMIF(Table13[Type of Care], \"QI\", Table13[Duration])>= 4, 4,IF(SUMIF(Table13[Type of Care], \"QI\", Table13[Duration])<= 3, SUMIF(Table13[Type of Care], \"QI\", Table13[Duration]), 0))))> 90)","v":false}]
[null,null,"",null,null,null,null,{"$f":"IF( B16 > $D$10+14, SUMIFS($G$13:G16, $D$13:D16,\"Direct/Indirect/Clinical Administration\", $B$13:B16,\">\"&$D$10 + 14) + ((IF(SUMIF(Table13[Type of Care], \"QI\", Table13[Duration])>= 4, 4,IF(SUMIF(Table13[Type of Care], \"QI\", Table13[Duration])<= 3, SUMIF(Table13[Type of Care], \"QI\", Table13[Duration]), 0))))  > 90, SUMIFS($G$13:G16, $D$13:D16,\"Direct/Indirect/Clinical Administration\",  $B$13:B16,\"<=\"&$D$10 + 14)+ ((IF(SUMIF(Table13[Type of Care], \"QI\", Table13[Duration])>= 4, 4,IF(SUMIF(Table13[Type of Care], \"QI\", Table13[Duration])<= 3, SUMIF(Table13[Type of Care], \"QI\", Table13[Duration]), 0))))> 90)","v":false}]
[null,null,"",null,null,null,null,{"$f":"IF( B17 > $D$10+14, SUMIFS($G$13:G17, $D$13:D17,\"Direct/Indirect/Clinical Administration\", $B$13:B17,\">\"&$D$10 + 14) + ((IF(SUMIF(Table13[Type of Care], \"QI\", Table13[Duration])>= 4, 4,IF(SUMIF(Table13[Type of Care], \"QI\", Table13[Duration])<= 3, SUMIF(Table13[Type of Care], \"QI\", Table13[Duration]), 0))))  > 90, SUMIFS($G$13:G17, $D$13:D17,\"Direct/Indirect/Clinical Administration\",  $B$13:B17,\"<=\"&$D$10 + 14)+ ((IF(SUMIF(Table13[Type of Care], \"QI\", Table13[Duration])>= 4, 4,IF(SUMIF(Table13[Type of Care], \"QI\", Table13[Duration])<= 3, SUMIF(Table13[Type of Care], \"QI\", Table13[Duration]), 0))))> 90)","v":false}]
[null,null,"",null,null,null,null,{"$f":"IF( B18 > $D$10+14, SUMIFS($G$13:G18, $D$13:D18,\"Direct/Indirect/Clinical Administration\", $B$13:B18,\">\"&$D$10 + 14) + ((IF(SUMIF(Table13[Type of Care], \"QI\", Table13[Duration])>= 4, 4,IF(SUMIF(Table13[Type of Care], \"QI\", Table13[Duration])<= 3, SUMIF(Table13[Type of Care], \"QI\", Table13[Duration]), 0))))  > 90, SUMIFS($G$13:G18, $D$13:D18,\"Direct/Indirect/Clinical Administration\",  $B$13:B18,\"<=\"&$D$10 + 14)+ ((IF(SUMIF(Table13[Type of Care], \"QI\", Table13[Duration])>= 4, 4,IF(SUMIF(Table13[Type of Care], \"QI\", Table13[Duration])<= 3, SUMIF(Table13[Type of Care], \"QI\", Table13[Duration]), 0))))> 90)","v":false}]
[null,null,"",null,null,null,null,{"$f":"IF( B19 > $D$10+14, SUMIFS($G$13:G19, $D$13:D19,\"Direct/Indirect/Clinical Administration\", $B$13:B19,\">\"&$D$10 + 14) + ((IF(SUMIF(Table13[Type of Care], \"QI\", Table13[Duration])>= 4, 4,IF(SUMIF(Table13[Type of Care], \"QI\", Table13[Duration])<= 3, SUMIF(Table13[Type of Care], \"QI\", Table13[Duration]), 0))))  > 90, SUMIFS($G$13:G19, $D$13:D19,\"Direct/Indirect/Clinical Administration\",  $B$13:B19,\"<=\"&$D$10 + 14)+ ((IF(SUMIF(Table13[Type of Care], \"QI\", Table13[Duration])>= 4, 4,IF(SUMIF(Table13[Type of Care], \"QI\", Table13[Duration])<= 3, SUMIF(Table13[Type of Care], \"QI\", Table13[Duration]), 0))))> 90)","v":false}]
[null,null,"",null,null,null,null,{"$f":"IF( B20 > $D$10+14, SUMIFS($G$13:G20, $D$13:D20,\"Direct/Indirect/Clinical Administration\", $B$13:B20,\">\"&$D$10 + 14) + ((IF(SUMIF(Table13[Type of Care], \"QI\", Table13[Duration])>= 4, 4,IF(SUMIF(Table13[Type of Care], \"QI\", Table13[Duration])<= 3, SUMIF(Table13[Type of Care], \"QI\", Table13[Duration]), 0))))  > 90, SUMIFS($G$13:G20, $D$13:D20,\"Direct/Indirect/Clinical Administration\",  $B$13:B20,\"<=\"&$D$10 + 14)+ ((IF(SUMIF(Table13[Type of Care], \"QI\", Table13[Duration])>= 4, 4,IF(SUMIF(Table13[Type of Care], \"QI\", Table13[Duration])<= 3, SUMIF(Table13[Type of Care], \"QI\", Table13[Duration]), 0))))> 90)","v":false}]
[null,null,"",null,null,null,null,{"$f":"IF( B21 > $D$10+14, SUMIFS($G$13:G21, $D$13:D21,\"Direct/Indirect/Clinical Administration\", $B$13:B21,\">\"&$D$10 + 14) + ((IF(SUMIF(Table13[Type of Care], \"QI\", Table13[Duration])>= 4, 4,IF(SUMIF(Table13[Type of Care], \"QI\", Table13[Duration])<= 3, SUMIF(Table13[Type of Care], \"QI\", Table13[Duration]), 0))))  > 90, SUMIFS($G$13:G21, $D$13:D21,\"Direct/Indirect/Clinical Administration\",  $B$13:B21,\"<=\"&$D$10 + 14)+ ((IF(SUMIF(Table13[Type of Care], \"QI\", Table13[Duration])>= 4, 4,IF(SUMIF(Table13[Type of Care], \"QI\", Table13[Duration])<= 3, SUMIF(Table13[Type of Care], \"QI\", Table13[Duration]), 0))))> 90)","v":false}]
[null,null,"",null,null,null,null,{"$f":"IF( B22 > $D$10+14, SUMIFS($G$13:G22, $D$13:D22,\"Direct/Indirect/Clinical Administration\", $B$13:B22,\">\"&$D$10 + 14) + ((IF(SUMIF(Table13[Type of Care], \"QI\", Table13[Duration])>= 4, 4,IF(SUMIF(Table13[Type of Care], \"QI\", Table13[Duration])<= 3, SUMIF(Table13[Type of Care], \"QI\", Table13[Duration]), 0))))  > 90, SUMIFS($G$13:G22, $D$13:D22,\"Direct/Indirect/Clinical Administration\",  $B$13:B22,\"<=\"&$D$10 + 14)+ ((IF(SUMIF(Table13[Type of Care], \"QI\", Table13[Duration])>= 4, 4,IF(SUMIF(Table13[Type of Care], \"QI\", Table13[Duration])<= 3, SUMIF(Table13[Type of Care], \"QI\", Table13[Duration]), 0))))> 90)","v":false}]
[null,null,"",null,null,null,null,{"$f":"IF( B23 > $D$10+14, SUMIFS($G$13:G23, $D$13:D23,\"Direct/Indirect/Clinical Administration\", $B$13:B23,\">\"&$D$10 + 14) + ((IF(SUMIF(Table13[Type of Care], \"QI\", Table13[Duration])>= 4, 4,IF(SUMIF(Table13[Type of Care], \"QI\", Table13[Duration])<= 3, SUMIF(Table13[Type of Care], \"QI\", Table13[Duration]), 0))))  > 90, SUMIFS($G$13:G23, $D$13:D23,\"Direct/Indirect/Clinical Administration\",  $B$13:B23,\"<=\"&$D$10 + 14)+ ((IF(SUMIF(Table13[Type of Care], \"QI\", Table13[Duration])>= 4, 4,IF(SUMIF(Table13[Type of Care], \"QI\", Table13[Duration])<= 3, SUMIF(Table13[Type of Care], \"QI\", Table13[Duration]), 0))))> 90)","v":false}]
[null,null,"",null,null,null,null,{"$f":"IF( B24 > $D$10+14, SUMIFS($G$13:G24, $D$13:D24,\"Direct/Indirect/Clinical Administration\", $B$13:B24,\">\"&$D$10 + 14) + ((IF(SUMIF(Table13[Type of Care], \"QI\", Table13[Duration])>= 4, 4,IF(SUMIF(Table13[Type of Care], \"QI\", Table13[Duration])<= 3, SUMIF(Table13[Type of Care], \"QI\", Table13[Duration]), 0))))  > 90, SUMIFS($G$13:G24, $D$13:D24,\"Direct/Indirect/Clinical Administration\",  $B$13:B24,\"<=\"&$D$10 + 14)+ ((IF(SUMIF(Table13[Type of Care], \"QI\", Table13[Duration])>= 4, 4,IF(SUMIF(Table13[Type of Care], \"QI\", Table13[Duration])<= 3, SUMIF(Table13[Type of Care], \"QI\", Table13[Duration]), 0))))> 90)","v":false}]
[null,null,{"$f":"IF(B25=\"\", \"\", B25)","v":""},null,null,null,null,{"$f":"IF( B25 > $D$10+14, SUMIFS($G$13:G25, $D$13:D25,\"Direct/Indirect/Clinical Administration\", $B$13:B25,\">\"&$D$10 + 14) + ((IF(SUMIF(Table13[Type of Care], \"QI\", Table13[Duration])>= 4, 4,IF(SUMIF(Table13[Type of Care], \"QI\", Table13[Duration])<= 3, SUMIF(Table13[Type of Care], \"QI\", Table13[Duration]), 0))))  > 90, SUMIFS($G$13:G25, $D$13:D25,\"Direct/Indirect/Clinical Administration\",  $B$13:B25,\"<=\"&$D$10 + 14)+ ((IF(SUMIF(Table13[Type of Care], \"QI\", Table13[Duration])>= 4, 4,IF(SUMIF(Table13[Type of Care], \"QI\", Table13[Duration])<= 3, SUMIF(Table13[Type of Care], \"QI\", Table13[Duration]), 0))))> 90)","v":false}]
[null,null,{"$f":"IF(B26=\"\", \"\", B26)","v":""},null,null,null,null,{"$f":"IF( B26 > $D$10+14, SUMIFS($G$13:G26, $D$13:D26,\"Direct/Indirect/Clinical Administration\", $B$13:B26,\">\"&$D$10 + 14) + ((IF(SUMIF(Table13[Type of Care], \"QI\", Table13[Duration])>= 4, 4,IF(SUMIF(Table13[Type of Care], \"QI\", Table13[Duration])<= 3, SUMIF(Table13[Type of Care], \"QI\", Table13[Duration]), 0))))  > 90, SUMIFS($G$13:G26, $D$13:D26,\"Direct/Indirect/Clinical Administration\",  $B$13:B26,\"<=\"&$D$10 + 14)+ ((IF(SUMIF(Table13[Type of Care], \"QI\", Table13[Duration])>= 4, 4,IF(SUMIF(Table13[Type of Care], \"QI\", Table13[Duration])<= 3, SUMIF(Table13[Type of Care], \"QI\", Table13[Duration]), 0))))> 90)","v":false}]
[null,null,"",null,null,null,null,{"$f":"IF( B27 > $D$10+14, SUMIFS($G$13:G27, $D$13:D27,\"Direct/Indirect/Clinical Administration\", $B$13:B27,\">\"&$D$10 + 14) + ((IF(SUMIF(Table13[Type of Care], \"QI\", Table13[Duration])>= 4, 4,IF(SUMIF(Table13[Type of Care], \"QI\", Table13[Duration])<= 3, SUMIF(Table13[Type of Care], \"QI\", Table13[Duration]), 0))))  > 90, SUMIFS($G$13:G27, $D$13:D27,\"Direct/Indirect/Clinical Administration\",  $B$13:B27,\"<=\"&$D$10 + 14)+ ((IF(SUMIF(Table13[Type of Care], \"QI\", Table13[Duration])>= 4, 4,IF(SUMIF(Table13[Type of Care], \"QI\", Table13[Duration])<= 3, SUMIF(Table13[Type of Care], \"QI\", Table13[Duration]), 0))))> 90)","v":false}]
[null,null,"",null,null,null,null,{"$f":"IF( B28 > $D$10+14, SUMIFS($G$13:G28, $D$13:D28,\"Direct/Indirect/Clinical Administration\", $B$13:B28,\">\"&$D$10 + 14) + ((IF(SUMIF(Table13[Type of Care], \"QI\", Table13[Duration])>= 4, 4,IF(SUMIF(Table13[Type of Care], \"QI\", Table13[Duration])<= 3, SUMIF(Table13[Type of Care], \"QI\", Table13[Duration]), 0))))  > 90, SUMIFS($G$13:G28, $D$13:D28,\"Direct/Indirect/Clinical Administration\",  $B$13:B28,\"<=\"&$D$10 + 14)+ ((IF(SUMIF(Table13[Type of Care], \"QI\", Table13[Duration])>= 4, 4,IF(SUMIF(Table13[Type of Care], \"QI\", Table13[Duration])<= 3, SUMIF(Table13[Type of Care], \"QI\", Table13[Duration]), 0))))> 90)","v":false}]
[null,null,"",null,null,null,null,{"$f":"IF( B29 > $D$10+14, SUMIFS($G$13:G29, $D$13:D29,\"Direct/Indirect/Clinical Administration\", $B$13:B29,\">\"&$D$10 + 14) + ((IF(SUMIF(Table13[Type of Care], \"QI\", Table13[Duration])>= 4, 4,IF(SUMIF(Table13[Type of Care], \"QI\", Table13[Duration])<= 3, SUMIF(Table13[Type of Care], \"QI\", Table13[Duration]), 0))))  > 90, SUMIFS($G$13:G29, $D$13:D29,\"Direct/Indirect/Clinical Administration\",  $B$13:B29,\"<=\"&$D$10 + 14)+ ((IF(SUMIF(Table13[Type of Care], \"QI\", Table13[Duration])>= 4, 4,IF(SUMIF(Table13[Type of Care], \"QI\", Table13[Duration])<= 3, SUMIF(Table13[Type of Care], \"QI\", Table13[Duration]), 0))))> 90)","v":false}]
[null,null,{"$f":"IF(B30=\"\", \"\", B30)","v":""},null,null,null,null,{"$f":"IF( B30 > $D$10+14, SUMIFS($G$13:G30, $D$13:D30,\"Direct/Indirect/Clinical Administration\", $B$13:B30,\">\"&$D$10 + 14) + ((IF(SUMIF(Table13[Type of Care], \"QI\", Table13[Duration])>= 4, 4,IF(SUMIF(Table13[Type of Care], \"QI\", Table13[Duration])<= 3, SUMIF(Table13[Type of Care], \"QI\", Table13[Duration]), 0))))  > 90, SUMIFS($G$13:G30, $D$13:D30,\"Direct/Indirect/Clinical Administration\",  $B$13:B30,\"<=\"&$D$10 + 14)+ ((IF(SUMIF(Table13[Type of Care], \"QI\", Table13[Duration])>= 4, 4,IF(SUMIF(Table13[Type of Care], \"QI\", Table13[Duration])<= 3, SUMIF(Table13[Type of Care], \"QI\", Table13[Duration]), 0))))> 90)","v":false}]
[null,null,"",null,null,null,null,{"$f":"IF( B31 > $D$10+14, SUMIFS($G$13:G31, $D$13:D31,\"Direct/Indirect/Clinical Administration\", $B$13:B31,\">\"&$D$10 + 14) + ((IF(SUMIF(Table13[Type of Care], \"QI\", Table13[Duration])>= 4, 4,IF(SUMIF(Table13[Type of Care], \"QI\", Table13[Duration])<= 3, SUMIF(Table13[Type of Care], \"QI\", Table13[Duration]), 0))))  > 90, SUMIFS($G$13:G31, $D$13:D31,\"Direct/Indirect/Clinical Administration\",  $B$13:B31,\"<=\"&$D$10 + 14)+ ((IF(SUMIF(Table13[Type of Care], \"QI\", Table13[Duration])>= 4, 4,IF(SUMIF(Table13[Type of Care], \"QI\", Table13[Duration])<= 3, SUMIF(Table13[Type of Care], \"QI\", Table13[Duration]), 0))))> 90)","v":false}]
[null,null,"",null,null,null,null,{"$f":"IF( B32 > $D$10+14, SUMIFS($G$13:G32, $D$13:D32,\"Direct/Indirect/Clinical Administration\", $B$13:B32,\">\"&$D$10 + 14) + ((IF(SUMIF(Table13[Type of Care], \"QI\", Table13[Duration])>= 4, 4,IF(SUMIF(Table13[Type of Care], \"QI\", Table13[Duration])<= 3, SUMIF(Table13[Type of Care], \"QI\", Table13[Duration]), 0))))  > 90, SUMIFS($G$13:G32, $D$13:D32,\"Direct/Indirect/Clinical Administration\",  $B$13:B32,\"<=\"&$D$10 + 14)+ ((IF(SUMIF(Table13[Type of Care], \"QI\", Table13[Duration])>= 4, 4,IF(SUMIF(Table13[Type of Care], \"QI\", Table13[Duration])<= 3, SUMIF(Table13[Type of Care], \"QI\", Table13[Duration]), 0))))> 90)","v":false}]
[null,null,"",null,null,null,null,{"$f":"IF( B33 > $D$10+14, SUMIFS($G$13:G33, $D$13:D33,\"Direct/Indirect/Clinical Administration\", $B$13:B33,\">\"&$D$10 + 14) + ((IF(SUMIF(Table13[Type of Care], \"QI\", Table13[Duration])>= 4, 4,IF(SUMIF(Table13[Type of Care], \"QI\", Table13[Duration])<= 3, SUMIF(Table13[Type of Care], \"QI\", Table13[Duration]), 0))))  > 90, SUMIFS($G$13:G33, $D$13:D33,\"Direct/Indirect/Clinical Administration\",  $B$13:B33,\"<=\"&$D$10 + 14)+ ((IF(SUMIF(Table13[Type of Care], \"QI\", Table13[Duration])>= 4, 4,IF(SUMIF(Table13[Type of Care], \"QI\", Table13[Duration])<= 3, SUMIF(Table13[Type of Care], \"QI\", Table13[Duration]), 0))))> 90)","v":false}]
[null,null,{"$f":"IF(B34=\"\", \"\", B34)","v":""},null,null,null,null,{"$f":"IF( B34 > $D$10+14, SUMIFS($G$13:G34, $D$13:D34,\"Direct/Indirect/Clinical Administration\", $B$13:B34,\">\"&$D$10 + 14) + ((IF(SUMIF(Table13[Type of Care], \"QI\", Table13[Duration])>= 4, 4,IF(SUMIF(Table13[Type of Care], \"QI\", Table13[Duration])<= 3, SUMIF(Table13[Type of Care], \"QI\", Table13[Duration]), 0))))  > 90, SUMIFS($G$13:G34, $D$13:D34,\"Direct/Indirect/Clinical Administration\",  $B$13:B34,\"<=\"&$D$10 + 14)+ ((IF(SUMIF(Table13[Type of Care], \"QI\", Table13[Duration])>= 4, 4,IF(SUMIF(Table13[Type of Care], \"QI\", Table13[Duration])<= 3, SUMIF(Table13[Type of Care], \"QI\", Table13[Duration]), 0))))> 90)","v":false}]
[null,null,{"$f":"IF(B35=\"\", \"\", B35)","v":""},null,null,"Total Contract Hours",{"$f":"(SUMIF(Table13[Type of Care], \"Direct/Indirect/Clinical Administration\",Table13[Duration]))","v":0},"CT1"]
[null,null,null,null,null,"Total Included QI Hours",{"$f":"(IF(SUMIF(Table13[Type of Care], \"QI\", Table13[Duration])>= 4, 4,IF(SUMIF(Table13[Type of Care], \"QI\", Table13[Duration])<= 3, SUMIF(Table13[Type of Care], \"QI\", Table13[Duration]), 0)))","v":0},"QI1"]
[null,null,null,null,null,"Total Excluded Hours",{"$f":"G38+G39","v":0},"EX1"]
[null,null,null,null,null,"         Excluded Contract Hours",{"$f":"(SUMIF(Table13[Type of Care], \"Third Party/Specialist FFS\",Table13[Duration])) + (SUMIF(Table13[Type of Care], \"Break (>15 Minutes)\", Table13[Duration]))","v":0},"EXC1"]
[null,null,null,null,null,"      Excluded QI Hours",{"$f":"(SUMIF(Table13[Type of Care], \"QI\", Table13[Duration]) - (IF(SUMIF(Table13[Type of Care], \"QI\", Table13[Duration])>= 4, 4,IF(SUMIF(Table13[Type of Care], \"QI\", Table13[Duration])<= 3, SUMIF(Table13[Type of Care], \"QI\", Table13[Duration]), 0))))","v":0},"EXQI1"]
[null,null,{"$f":"IF(B40=\"\", \"\", B40)","v":""},null,null,"Hours Above 90hr/semi-monthly",{"$f":"  (IF(SUMIFS(Table13[Duration],Table13[Date (YYYY-MM-DD)], \">\"&$D$10+14, Table13[Type of Care], \"Direct/Indirect/Clinical Administration\")>= 90, (SUMIFS(Table13[Duration],Table13[Date (YYYY-MM-DD)], \">\"&$D$10+14, Table13[Type of Care], \"Direct/Indirect/Clinical Administration\")+ (IF(SUMIF(Table13[Type of Care], \"QI\", Table13[Duration])>= 4, 4,IF(SUMIF(Table13[Type of Care], \"QI\", Table13[Duration])<= 3, SUMIF(Table13[Type of Care], \"QI\", Table13[Duration]), 0))) -90))) + (IF(SUMIFS(Table13[Duration],Table13[Date (YYYY-MM-DD)], \"<=\"&$D$10+14, Table13[Type of Care], \"Direct/Indirect/Clinical Administration\")>= 90, (SUMIFS(Table13[Duration],Table13[Date (YYYY-MM-DD)], \"<=\"&$D$10+14, Table13[Type of Care], \"Direct/Indirect/Clinical Administration\")+ (IF(SUMIF(Table13[Type of Care], \"QI\", Table13[Duration])>= 4, 4,IF(SUMIF(Table13[Type of Care], \"QI\", Table13[Duration])<= 3, SUMIF(Table13[Type of Care], \"QI\", Table13[Duration]), 0))) -90)))","v":0},"A901"]
[]
[]
[null,{"$f":"IF(Clinic!C5=\"Jan - Mar\", \"February\", IF(Clinic!C5= \"Apr - June\", \"May\", IF(Clinic!C5=\"July - Sept\", \"August\", IF(Clinic!C5=\" Oct - Dec\", \"November\"))))","v":"February"},{"$f":"Clinic!C6","v":2021},{"$f":"DATE(YEAR(B46),MONTH(DATEVALUE(B43&\"1\")),1)","v":"1900-02-01"},null,null,null,"Month2"]
[]
[null,"Date (YYYY-MM-DD)","Day ","Type of Care","Start Time AM/PM","End Time AM/PM","Duration","FALSE/TRUE"]
[null,null,{"$f":"IF(B46=\"\", \"\", B46)","v":""},null,null,null,null,{"$f":"IF( B46 > $D$43+14, SUMIFS($G$46:G46, $D$46:D46,\"Direct/Indirect/Clinical Administration\", $B$46:B46,\">\"&$D$43 + 14) + ((IF(SUMIF(Table132[Type of Care], \"QI\", Table132[Duration])>= 4, 4,IF(SUMIF(Table132[Type of Care], \"QI\", Table132[Duration])<= 3, SUMIF(Table132[Type of Care], \"QI\", Table132[Duration]), 0))))  > 90, SUMIFS($G$46:G46, $D$46:D46,\"Direct/Indirect/Clinical Administration\",  $B$46:B46,\"<=\"&$D$43 + 14)+ ((IF(SUMIF(Table132[Type of Care], \"QI\", Table132[Duration])>= 4, 4,IF(SUMIF(Table132[Type of Care], \"QI\", Table132[Duration])<= 3, SUMIF(Table132[Type of Care], \"QI\", Table132[Duration]), 0))))> 90)","v":false}]
[null,null,{"$f":"IF(B47=\"\", \"\", B47)","v":""},null,null,null,null,{"$f":"IF( B47 > $D$43+14, SUMIFS($G$46:G47, $D$46:D47,\"Direct/Indirect/Clinical Administration\", $B$46:B47,\">\"&$D$43 + 14) + ((IF(SUMIF(Table132[Type of Care], \"QI\", Table132[Duration])>= 4, 4,IF(SUMIF(Table132[Type of Care], \"QI\", Table132[Duration])<= 3, SUMIF(Table132[Type of Care], \"QI\", Table132[Duration]), 0))))  > 90, SUMIFS($G$46:G47, $D$46:D47,\"Direct/Indirect/Clinical Administration\",  $B$46:B47,\"<=\"&$D$43 + 14)+ ((IF(SUMIF(Table132[Type of Care], \"QI\", Table132[Duration])>= 4, 4,IF(SUMIF(Table132[Type of Care], \"QI\", Table132[Duration])<= 3, SUMIF(Table132[Type of Care], \"QI\", Table132[Duration]), 0))))> 90)","v":false}]
[null,null,"",null,null,null,null,{"$f":"IF( B48 > $D$43+14, SUMIFS($G$46:G48, $D$46:D48,\"Direct/Indirect/Clinical Administration\", $B$46:B48,\">\"&$D$43 + 14) + ((IF(SUMIF(Table132[Type of Care], \"QI\", Table132[Duration])>= 4, 4,IF(SUMIF(Table132[Type of Care], \"QI\", Table132[Duration])<= 3, SUMIF(Table132[Type of Care], \"QI\", Table132[Duration]), 0))))  > 90, SUMIFS($G$46:G48, $D$46:D48,\"Direct/Indirect/Clinical Administration\",  $B$46:B48,\"<=\"&$D$43 + 14)+ ((IF(SUMIF(Table132[Type of Care], \"QI\", Table132[Duration])>= 4, 4,IF(SUMIF(Table132[Type of Care], \"QI\", Table132[Duration])<= 3, SUMIF(Table132[Type of Care], \"QI\", Table132[Duration]), 0))))> 90)","v":false}]
[null,null,"",null,null,null,null,{"$f":"IF( B49 > $D$43+14, SUMIFS($G$46:G49, $D$46:D49,\"Direct/Indirect/Clinical Administration\", $B$46:B49,\">\"&$D$43 + 14) + ((IF(SUMIF(Table132[Type of Care], \"QI\", Table132[Duration])>= 4, 4,IF(SUMIF(Table132[Type of Care], \"QI\", Table132[Duration])<= 3, SUMIF(Table132[Type of Care], \"QI\", Table132[Duration]), 0))))  > 90, SUMIFS($G$46:G49, $D$46:D49,\"Direct/Indirect/Clinical Administration\",  $B$46:B49,\"<=\"&$D$43 + 14)+ ((IF(SUMIF(Table132[Type of Care], \"QI\", Table132[Duration])>= 4, 4,IF(SUMIF(Table132[Type of Care], \"QI\", Table132[Duration])<= 3, SUMIF(Table132[Type of Care], \"QI\", Table132[Duration]), 0))))> 90)","v":false}]
[null,null,"",null,null,null,null,{"$f":"IF( B50 > $D$43+14, SUMIFS($G$46:G50, $D$46:D50,\"Direct/Indirect/Clinical Administration\", $B$46:B50,\">\"&$D$43 + 14) + ((IF(SUMIF(Table132[Type of Care], \"QI\", Table132[Duration])>= 4, 4,IF(SUMIF(Table132[Type of Care], \"QI\", Table132[Duration])<= 3, SUMIF(Table132[Type of Care], \"QI\", Table132[Duration]), 0))))  > 90, SUMIFS($G$46:G50, $D$46:D50,\"Direct/Indirect/Clinical Administration\",  $B$46:B50,\"<=\"&$D$43 + 14)+ ((IF(SUMIF(Table132[Type of Care], \"QI\", Table132[Duration])>= 4, 4,IF(SUMIF(Table132[Type of Care], \"QI\", Table132[Duration])<= 3, SUMIF(Table132[Type of Care], \"QI\", Table132[Duration]), 0))))> 90)","v":false}]
[null,null,"",null,null,null,null,{"$f":"IF( B51 > $D$43+14, SUMIFS($G$46:G51, $D$46:D51,\"Direct/Indirect/Clinical Administration\", $B$46:B51,\">\"&$D$43 + 14) + ((IF(SUMIF(Table132[Type of Care], \"QI\", Table132[Duration])>= 4, 4,IF(SUMIF(Table132[Type of Care], \"QI\", Table132[Duration])<= 3, SUMIF(Table132[Type of Care], \"QI\", Table132[Duration]), 0))))  > 90, SUMIFS($G$46:G51, $D$46:D51,\"Direct/Indirect/Clinical Administration\",  $B$46:B51,\"<=\"&$D$43 + 14)+ ((IF(SUMIF(Table132[Type of Care], \"QI\", Table132[Duration])>= 4, 4,IF(SUMIF(Table132[Type of Care], \"QI\", Table132[Duration])<= 3, SUMIF(Table132[Type of Care], \"QI\", Table132[Duration]), 0))))> 90)","v":false}]
[null,null,"",null,null,null,null,{"$f":"IF( B52 > $D$43+14, SUMIFS($G$46:G52, $D$46:D52,\"Direct/Indirect/Clinical Administration\", $B$46:B52,\">\"&$D$43 + 14) + ((IF(SUMIF(Table132[Type of Care], \"QI\", Table132[Duration])>= 4, 4,IF(SUMIF(Table132[Type of Care], \"QI\", Table132[Duration])<= 3, SUMIF(Table132[Type of Care], \"QI\", Table132[Duration]), 0))))  > 90, SUMIFS($G$46:G52, $D$46:D52,\"Direct/Indirect/Clinical Administration\",  $B$46:B52,\"<=\"&$D$43 + 14)+ ((IF(SUMIF(Table132[Type of Care], \"QI\", Table132[Duration])>= 4, 4,IF(SUMIF(Table132[Type of Care], \"QI\", Table132[Duration])<= 3, SUMIF(Table132[Type of Care], \"QI\", Table132[Duration]), 0))))> 90)","v":false}]
[null,null,"",null,null,null,null,{"$f":"IF( B53 > $D$43+14, SUMIFS($G$46:G53, $D$46:D53,\"Direct/Indirect/Clinical Administration\", $B$46:B53,\">\"&$D$43 + 14) + ((IF(SUMIF(Table132[Type of Care], \"QI\", Table132[Duration])>= 4, 4,IF(SUMIF(Table132[Type of Care], \"QI\", Table132[Duration])<= 3, SUMIF(Table132[Type of Care], \"QI\", Table132[Duration]), 0))))  > 90, SUMIFS($G$46:G53, $D$46:D53,\"Direct/Indirect/Clinical Administration\",  $B$46:B53,\"<=\"&$D$43 + 14)+ ((IF(SUMIF(Table132[Type of Care], \"QI\", Table132[Duration])>= 4, 4,IF(SUMIF(Table132[Type of Care], \"QI\", Table132[Duration])<= 3, SUMIF(Table132[Type of Care], \"QI\", Table132[Duration]), 0))))> 90)","v":false}]
[null,null,"",null,null,null,null,{"$f":"IF( B54 > $D$43+14, SUMIFS($G$46:G54, $D$46:D54,\"Direct/Indirect/Clinical Administration\", $B$46:B54,\">\"&$D$43 + 14) + ((IF(SUMIF(Table132[Type of Care], \"QI\", Table132[Duration])>= 4, 4,IF(SUMIF(Table132[Type of Care], \"QI\", Table132[Duration])<= 3, SUMIF(Table132[Type of Care], \"QI\", Table132[Duration]), 0))))  > 90, SUMIFS($G$46:G54, $D$46:D54,\"Direct/Indirect/Clinical Administration\",  $B$46:B54,\"<=\"&$D$43 + 14)+ ((IF(SUMIF(Table132[Type of Care], \"QI\", Table132[Duration])>= 4, 4,IF(SUMIF(Table132[Type of Care], \"QI\", Table132[Duration])<= 3, SUMIF(Table132[Type of Care], \"QI\", Table132[Duration]), 0))))> 90)","v":false}]
[null,null,"",null,null,null,null,{"$f":"IF( B55 > $D$43+14, SUMIFS($G$46:G55, $D$46:D55,\"Direct/Indirect/Clinical Administration\", $B$46:B55,\">\"&$D$43 + 14) + ((IF(SUMIF(Table132[Type of Care], \"QI\", Table132[Duration])>= 4, 4,IF(SUMIF(Table132[Type of Care], \"QI\", Table132[Duration])<= 3, SUMIF(Table132[Type of Care], \"QI\", Table132[Duration]), 0))))  > 90, SUMIFS($G$46:G55, $D$46:D55,\"Direct/Indirect/Clinical Administration\",  $B$46:B55,\"<=\"&$D$43 + 14)+ ((IF(SUMIF(Table132[Type of Care], \"QI\", Table132[Duration])>= 4, 4,IF(SUMIF(Table132[Type of Care], \"QI\", Table132[Duration])<= 3, SUMIF(Table132[Type of Care], \"QI\", Table132[Duration]), 0))))> 90)","v":false}]
[null,null,"",null,null,null,null,{"$f":"IF( B56 > $D$43+14, SUMIFS($G$46:G56, $D$46:D56,\"Direct/Indirect/Clinical Administration\", $B$46:B56,\">\"&$D$43 + 14) + ((IF(SUMIF(Table132[Type of Care], \"QI\", Table132[Duration])>= 4, 4,IF(SUMIF(Table132[Type of Care], \"QI\", Table132[Duration])<= 3, SUMIF(Table132[Type of Care], \"QI\", Table132[Duration]), 0))))  > 90, SUMIFS($G$46:G56, $D$46:D56,\"Direct/Indirect/Clinical Administration\",  $B$46:B56,\"<=\"&$D$43 + 14)+ ((IF(SUMIF(Table132[Type of Care], \"QI\", Table132[Duration])>= 4, 4,IF(SUMIF(Table132[Type of Care], \"QI\", Table132[Duration])<= 3, SUMIF(Table132[Type of Care], \"QI\", Table132[Duration]), 0))))> 90)","v":false}]
[null,null,"",null,null,null,null,{"$f":"IF( B57 > $D$43+14, SUMIFS($G$46:G57, $D$46:D57,\"Direct/Indirect/Clinical Administration\", $B$46:B57,\">\"&$D$43 + 14) + ((IF(SUMIF(Table132[Type of Care], \"QI\", Table132[Duration])>= 4, 4,IF(SUMIF(Table132[Type of Care], \"QI\", Table132[Duration])<= 3, SUMIF(Table132[Type of Care], \"QI\", Table132[Duration]), 0))))  > 90, SUMIFS($G$46:G57, $D$46:D57,\"Direct/Indirect/Clinical Administration\",  $B$46:B57,\"<=\"&$D$43 + 14)+ ((IF(SUMIF(Table132[Type of Care], \"QI\", Table132[Duration])>= 4, 4,IF(SUMIF(Table132[Type of Care], \"QI\", Table132[Duration])<= 3, SUMIF(Table132[Type of Care], \"QI\", Table132[Duration]), 0))))> 90)","v":false}]
[null,null,"",null,null,null,null,{"$f":"IF( B58 > $D$43+14, SUMIFS($G$46:G58, $D$46:D58,\"Direct/Indirect/Clinical Administration\", $B$46:B58,\">\"&$D$43 + 14) + ((IF(SUMIF(Table132[Type of Care], \"QI\", Table132[Duration])>= 4, 4,IF(SUMIF(Table132[Type of Care], \"QI\", Table132[Duration])<= 3, SUMIF(Table132[Type of Care], \"QI\", Table132[Duration]), 0))))  > 90, SUMIFS($G$46:G58, $D$46:D58,\"Direct/Indirect/Clinical Administration\",  $B$46:B58,\"<=\"&$D$43 + 14)+ ((IF(SUMIF(Table132[Type of Care], \"QI\", Table132[Duration])>= 4, 4,IF(SUMIF(Table132[Type of Care], \"QI\", Table132[Duration])<= 3, SUMIF(Table132[Type of Care], \"QI\", Table132[Duration]), 0))))> 90)","v":false}]
[null,null,"",null,null,null,null,{"$f":"IF( B59 > $D$43+14, SUMIFS($G$46:G59, $D$46:D59,\"Direct/Indirect/Clinical Administration\", $B$46:B59,\">\"&$D$43 + 14) + ((IF(SUMIF(Table132[Type of Care], \"QI\", Table132[Duration])>= 4, 4,IF(SUMIF(Table132[Type of Care], \"QI\", Table132[Duration])<= 3, SUMIF(Table132[Type of Care], \"QI\", Table132[Duration]), 0))))  > 90, SUMIFS($G$46:G59, $D$46:D59,\"Direct/Indirect/Clinical Administration\",  $B$46:B59,\"<=\"&$D$43 + 14)+ ((IF(SUMIF(Table132[Type of Care], \"QI\", Table132[Duration])>= 4, 4,IF(SUMIF(Table132[Type of Care], \"QI\", Table132[Duration])<= 3, SUMIF(Table132[Type of Care], \"QI\", Table132[Duration]), 0))))> 90)","v":false}]
[null,null,"",null,null,null,null,{"$f":"IF( B60 > $D$43+14, SUMIFS($G$46:G60, $D$46:D60,\"Direct/Indirect/Clinical Administration\", $B$46:B60,\">\"&$D$43 + 14) + ((IF(SUMIF(Table132[Type of Care], \"QI\", Table132[Duration])>= 4, 4,IF(SUMIF(Table132[Type of Care], \"QI\", Table132[Duration])<= 3, SUMIF(Table132[Type of Care], \"QI\", Table132[Duration]), 0))))  > 90, SUMIFS($G$46:G60, $D$46:D60,\"Direct/Indirect/Clinical Administration\",  $B$46:B60,\"<=\"&$D$43 + 14)+ ((IF(SUMIF(Table132[Type of Care], \"QI\", Table132[Duration])>= 4, 4,IF(SUMIF(Table132[Type of Care], \"QI\", Table132[Duration])<= 3, SUMIF(Table132[Type of Care], \"QI\", Table132[Duration]), 0))))> 90)","v":false}]
[null,null,{"$f":"IF(B61=\"\", \"\", B61)","v":""},null,null,null,null,{"$f":"IF( B61 > $D$43+14, SUMIFS($G$46:G61, $D$46:D61,\"Direct/Indirect/Clinical Administration\", $B$46:B61,\">\"&$D$43 + 14) + ((IF(SUMIF(Table132[Type of Care], \"QI\", Table132[Duration])>= 4, 4,IF(SUMIF(Table132[Type of Care], \"QI\", Table132[Duration])<= 3, SUMIF(Table132[Type of Care], \"QI\", Table132[Duration]), 0))))  > 90, SUMIFS($G$46:G61, $D$46:D61,\"Direct/Indirect/Clinical Administration\",  $B$46:B61,\"<=\"&$D$43 + 14)+ ((IF(SUMIF(Table132[Type of Care], \"QI\", Table132[Duration])>= 4, 4,IF(SUMIF(Table132[Type of Care], \"QI\", Table132[Duration])<= 3, SUMIF(Table132[Type of Care], \"QI\", Table132[Duration]), 0))))> 90)","v":false}]
[null,null,{"$f":"IF(B62=\"\", \"\", B62)","v":""},null,null,null,null,{"$f":"IF( B62 > $D$43+14, SUMIFS($G$46:G62, $D$46:D62,\"Direct/Indirect/Clinical Administration\", $B$46:B62,\">\"&$D$43 + 14) + ((IF(SUMIF(Table132[Type of Care], \"QI\", Table132[Duration])>= 4, 4,IF(SUMIF(Table132[Type of Care], \"QI\", Table132[Duration])<= 3, SUMIF(Table132[Type of Care], \"QI\", Table132[Duration]), 0))))  > 90, SUMIFS($G$46:G62, $D$46:D62,\"Direct/Indirect/Clinical Administration\",  $B$46:B62,\"<=\"&$D$43 + 14)+ ((IF(SUMIF(Table132[Type of Care], \"QI\", Table132[Duration])>= 4, 4,IF(SUMIF(Table132[Type of Care], \"QI\", Table132[Duration])<= 3, SUMIF(Table132[Type of Care], \"QI\", Table132[Duration]), 0))))> 90)","v":false}]
[null,null,"",null,null,null,null,{"$f":"IF( B63 > $D$43+14, SUMIFS($G$46:G63, $D$46:D63,\"Direct/Indirect/Clinical Administration\", $B$46:B63,\">\"&$D$43 + 14) + ((IF(SUMIF(Table132[Type of Care], \"QI\", Table132[Duration])>= 4, 4,IF(SUMIF(Table132[Type of Care], \"QI\", Table132[Duration])<= 3, SUMIF(Table132[Type of Care], \"QI\", Table132[Duration]), 0))))  > 90, SUMIFS($G$46:G63, $D$46:D63,\"Direct/Indirect/Clinical Administration\",  $B$46:B63,\"<=\"&$D$43 + 14)+ ((IF(SUMIF(Table132[Type of Care], \"QI\", Table132[Duration])>= 4, 4,IF(SUMIF(Table132[Type of Care], \"QI\", Table132[Duration])<= 3, SUMIF(Table132[Type of Care], \"QI\", Table132[Duration]), 0))))> 90)","v":false}]
[null,null,"",null,null,null,null,{"$f":"IF( B64 > $D$43+14, SUMIFS($G$46:G64, $D$46:D64,\"Direct/Indirect/Clinical Administration\", $B$46:B64,\">\"&$D$43 + 14) + ((IF(SUMIF(Table132[Type of Care], \"QI\", Table132[Duration])>= 4, 4,IF(SUMIF(Table132[Type of Care], \"QI\", Table132[Duration])<= 3, SUMIF(Table132[Type of Care], \"QI\", Table132[Duration]), 0))))  > 90, SUMIFS($G$46:G64, $D$46:D64,\"Direct/Indirect/Clinical Administration\",  $B$46:B64,\"<=\"&$D$43 + 14)+ ((IF(SUMIF(Table132[Type of Care], \"QI\", Table132[Duration])>= 4, 4,IF(SUMIF(Table132[Type of Care], \"QI\", Table132[Duration])<= 3, SUMIF(Table132[Type of Care], \"QI\", Table132[Duration]), 0))))> 90)","v":false}]
[null,null,"",null,null,null,null,{"$f":"IF( B65 > $D$43+14, SUMIFS($G$46:G65, $D$46:D65,\"Direct/Indirect/Clinical Administration\", $B$46:B65,\">\"&$D$43 + 14) + ((IF(SUMIF(Table132[Type of Care], \"QI\", Table132[Duration])>= 4, 4,IF(SUMIF(Table132[Type of Care], \"QI\", Table132[Duration])<= 3, SUMIF(Table132[Type of Care], \"QI\", Table132[Duration]), 0))))  > 90, SUMIFS($G$46:G65, $D$46:D65,\"Direct/Indirect/Clinical Administration\",  $B$46:B65,\"<=\"&$D$43 + 14)+ ((IF(SUMIF(Table132[Type of Care], \"QI\", Table132[Duration])>= 4, 4,IF(SUMIF(Table132[Type of Care], \"QI\", Table132[Duration])<= 3, SUMIF(Table132[Type of Care], \"QI\", Table132[Duration]), 0))))> 90)","v":false}]
[null,null,"",null,null,null,null,{"$f":"IF( B66 > $D$43+14, SUMIFS($G$46:G66, $D$46:D66,\"Direct/Indirect/Clinical Administration\", $B$46:B66,\">\"&$D$43 + 14) + ((IF(SUMIF(Table132[Type of Care], \"QI\", Table132[Duration])>= 4, 4,IF(SUMIF(Table132[Type of Care], \"QI\", Table132[Duration])<= 3, SUMIF(Table132[Type of Care], \"QI\", Table132[Duration]), 0))))  > 90, SUMIFS($G$46:G66, $D$46:D66,\"Direct/Indirect/Clinical Administration\",  $B$46:B66,\"<=\"&$D$43 + 14)+ ((IF(SUMIF(Table132[Type of Care], \"QI\", Table132[Duration])>= 4, 4,IF(SUMIF(Table132[Type of Care], \"QI\", Table132[Duration])<= 3, SUMIF(Table132[Type of Care], \"QI\", Table132[Duration]), 0))))> 90)","v":false}]
[null,null,"",null,null,null,null,{"$f":"IF( B67 > $D$43+14, SUMIFS($G$46:G67, $D$46:D67,\"Direct/Indirect/Clinical Administration\", $B$46:B67,\">\"&$D$43 + 14) + ((IF(SUMIF(Table132[Type of Care], \"QI\", Table132[Duration])>= 4, 4,IF(SUMIF(Table132[Type of Care], \"QI\", Table132[Duration])<= 3, SUMIF(Table132[Type of Care], \"QI\", Table132[Duration]), 0))))  > 90, SUMIFS($G$46:G67, $D$46:D67,\"Direct/Indirect/Clinical Administration\",  $B$46:B67,\"<=\"&$D$43 + 14)+ ((IF(SUMIF(Table132[Type of Care], \"QI\", Table132[Duration])>= 4, 4,IF(SUMIF(Table132[Type of Care], \"QI\", Table132[Duration])<= 3, SUMIF(Table132[Type of Care], \"QI\", Table132[Duration]), 0))))> 90)","v":false}]
[null,null,{"$f":"IF(B68=\"\", \"\", B68)","v":""},null,null,null,null,{"$f":"IF( B68 > $D$43+14, SUMIFS($G$46:G68, $D$46:D68,\"Direct/Indirect/Clinical Administration\", $B$46:B68,\">\"&$D$43 + 14) + ((IF(SUMIF(Table132[Type of Care], \"QI\", Table132[Duration])>= 4, 4,IF(SUMIF(Table132[Type of Care], \"QI\", Table132[Duration])<= 3, SUMIF(Table132[Type of Care], \"QI\", Table132[Duration]), 0))))  > 90, SUMIFS($G$46:G68, $D$46:D68,\"Direct/Indirect/Clinical Administration\",  $B$46:B68,\"<=\"&$D$43 + 14)+ ((IF(SUMIF(Table132[Type of Care], \"QI\", Table132[Duration])>= 4, 4,IF(SUMIF(Table132[Type of Care], \"QI\", Table132[Duration])<= 3, SUMIF(Table132[Type of Care], \"QI\", Table132[Duration]), 0))))> 90)","v":false}]
[null,null,"",null,null,null,null,{"$f":"IF( B69 > $D$43+14, SUMIFS($G$46:G69, $D$46:D69,\"Direct/Indirect/Clinical Administration\", $B$46:B69,\">\"&$D$43 + 14) + ((IF(SUMIF(Table132[Type of Care], \"QI\", Table132[Duration])>= 4, 4,IF(SUMIF(Table132[Type of Care], \"QI\", Table132[Duration])<= 3, SUMIF(Table132[Type of Care], \"QI\", Table132[Duration]), 0))))  > 90, SUMIFS($G$46:G69, $D$46:D69,\"Direct/Indirect/Clinical Administration\",  $B$46:B69,\"<=\"&$D$43 + 14)+ ((IF(SUMIF(Table132[Type of Care], \"QI\", Table132[Duration])>= 4, 4,IF(SUMIF(Table132[Type of Care], \"QI\", Table132[Duration])<= 3, SUMIF(Table132[Type of Care], \"QI\", Table132[Duration]), 0))))> 90)","v":false}]
[null,null,"",null,null,null,null,{"$f":"IF( B70 > $D$43+14, SUMIFS($G$46:G70, $D$46:D70,\"Direct/Indirect/Clinical Administration\", $B$46:B70,\">\"&$D$43 + 14) + ((IF(SUMIF(Table132[Type of Care], \"QI\", Table132[Duration])>= 4, 4,IF(SUMIF(Table132[Type of Care], \"QI\", Table132[Duration])<= 3, SUMIF(Table132[Type of Care], \"QI\", Table132[Duration]), 0))))  > 90, SUMIFS($G$46:G70, $D$46:D70,\"Direct/Indirect/Clinical Administration\",  $B$46:B70,\"<=\"&$D$43 + 14)+ ((IF(SUMIF(Table132[Type of Care], \"QI\", Table132[Duration])>= 4, 4,IF(SUMIF(Table132[Type of Care], \"QI\", Table132[Duration])<= 3, SUMIF(Table132[Type of Care], \"QI\", Table132[Duration]), 0))))> 90)","v":false}]
[null,null,"",null,null,null,null,{"$f":"IF( B71 > $D$43+14, SUMIFS($G$46:G71, $D$46:D71,\"Direct/Indirect/Clinical Administration\", $B$46:B71,\">\"&$D$43 + 14) + ((IF(SUMIF(Table132[Type of Care], \"QI\", Table132[Duration])>= 4, 4,IF(SUMIF(Table132[Type of Care], \"QI\", Table132[Duration])<= 3, SUMIF(Table132[Type of Care], \"QI\", Table132[Duration]), 0))))  > 90, SUMIFS($G$46:G71, $D$46:D71,\"Direct/Indirect/Clinical Administration\",  $B$46:B71,\"<=\"&$D$43 + 14)+ ((IF(SUMIF(Table132[Type of Care], \"QI\", Table132[Duration])>= 4, 4,IF(SUMIF(Table132[Type of Care], \"QI\", Table132[Duration])<= 3, SUMIF(Table132[Type of Care], \"QI\", Table132[Duration]), 0))))> 90)","v":false}]
[null,null,"",null,null,null,null,{"$f":"IF( B72 > $D$43+14, SUMIFS($G$46:G72, $D$46:D72,\"Direct/Indirect/Clinical Administration\", $B$46:B72,\">\"&$D$43 + 14) + ((IF(SUMIF(Table132[Type of Care], \"QI\", Table132[Duration])>= 4, 4,IF(SUMIF(Table132[Type of Care], \"QI\", Table132[Duration])<= 3, SUMIF(Table132[Type of Care], \"QI\", Table132[Duration]), 0))))  > 90, SUMIFS($G$46:G72, $D$46:D72,\"Direct/Indirect/Clinical Administration\",  $B$46:B72,\"<=\"&$D$43 + 14)+ ((IF(SUMIF(Table132[Type of Care], \"QI\", Table132[Duration])>= 4, 4,IF(SUMIF(Table132[Type of Care], \"QI\", Table132[Duration])<= 3, SUMIF(Table132[Type of Care], \"QI\", Table132[Duration]), 0))))> 90)","v":false}]
[null,null,"",null,null,null,null,{"$f":"IF( B73 > $D$43+14, SUMIFS($G$46:G73, $D$46:D73,\"Direct/Indirect/Clinical Administration\", $B$46:B73,\">\"&$D$43 + 14) + ((IF(SUMIF(Table132[Type of Care], \"QI\", Table132[Duration])>= 4, 4,IF(SUMIF(Table132[Type of Care], \"QI\", Table132[Duration])<= 3, SUMIF(Table132[Type of Care], \"QI\", Table132[Duration]), 0))))  > 90, SUMIFS($G$46:G73, $D$46:D73,\"Direct/Indirect/Clinical Administration\",  $B$46:B73,\"<=\"&$D$43 + 14)+ ((IF(SUMIF(Table132[Type of Care], \"QI\", Table132[Duration])>= 4, 4,IF(SUMIF(Table132[Type of Care], \"QI\", Table132[Duration])<= 3, SUMIF(Table132[Type of Care], \"QI\", Table132[Duration]), 0))))> 90)","v":false}]
[null,null,"",null,null,null,null,{"$f":"IF( B74 > $D$43+14, SUMIFS($G$46:G74, $D$46:D74,\"Direct/Indirect/Clinical Administration\", $B$46:B74,\">\"&$D$43 + 14) + ((IF(SUMIF(Table132[Type of Care], \"QI\", Table132[Duration])>= 4, 4,IF(SUMIF(Table132[Type of Care], \"QI\", Table132[Duration])<= 3, SUMIF(Table132[Type of Care], \"QI\", Table132[Duration]), 0))))  > 90, SUMIFS($G$46:G74, $D$46:D74,\"Direct/Indirect/Clinical Administration\",  $B$46:B74,\"<=\"&$D$43 + 14)+ ((IF(SUMIF(Table132[Type of Care], \"QI\", Table132[Duration])>= 4, 4,IF(SUMIF(Table132[Type of Care], \"QI\", Table132[Duration])<= 3, SUMIF(Table132[Type of Care], \"QI\", Table132[Duration]), 0))))> 90)","v":false}]
[null,null,{"$f":"IF(B75=\"\", \"\", B75)","v":""},null,null,"Total Contract Hours",{"$f":"(SUMIF(Table132[Type of Care], \"Direct/Indirect/Clinical Administration\",Table132[Duration])) + (SUMIF(Table132[Type of Care], \"Correction Hours\",Table132[Duration]))","v":0},"CT2"]
[null,null,null,null,null,"Total Included QI Hours",{"$f":"(IF(SUMIF(Table132[Type of Care], \"QI\", Table132[Duration])>= 4, 4,IF(SUMIF(Table132[Type of Care], \"QI\", Table132[Duration])<= 3, SUMIF(Table132[Type of Care], \"QI\", Table132[Duration]), 0)))","v":0},"QI2"]
[null,null,null,null,null,"Total Excluded Hours",{"$f":"G78+G79","v":0},"EX2"]
[null,null,null,null,null,"         Excluded Contract Hours",{"$f":"(SUMIF(Table132[Type of Care], \"Third Party/Specialist FFS\",Table132[Duration])) + (SUMIF(Table132[Type of Care], \"Break (>15 Minutes)\", Table132[Duration]))","v":0},"EXC2"]
[null,null,null,null,null,"      Excluded QI Hours",{"$f":"(SUMIF(Table132[Type of Care], \"QI\", Table132[Duration]) - (IF(SUMIF(Table132[Type of Care], \"QI\", Table132[Duration])>= 4, 4,IF(SUMIF(Table132[Type of Care], \"QI\", Table132[Duration])<= 3, SUMIF(Table132[Type of Care], \"QI\", Table132[Duration]), 0))))","v":0},"EXQI2"]
[null,null,{"$f":"IF(B80=\"\", \"\", B80)","v":""},null,null,"Hours Above 90hr/semi-monthly",{"$f":"  (IF(SUMIFS(Table132[Duration],Table132[Date (YYYY-MM-DD)], \">\"&$D$43+14, Table132[Type of Care], \"Direct/Indirect/Clinical Administration\")>= 90, (SUMIFS(Table132[Duration],Table132[Date (YYYY-MM-DD)], \">\"&$D$43+14, Table132[Type of Care], \"Direct/Indirect/Clinical Administration\")+ (IF(SUMIF(Table132[Type of Care], \"QI\", Table132[Duration])>= 4, 4,IF(SUMIF(Table132[Type of Care], \"QI\", Table132[Duration])<= 3, SUMIF(Table132[Type of Care], \"QI\", Table132[Duration]), 0))) -90))) + (IF(SUMIFS(Table132[Duration],Table132[Date (YYYY-MM-DD)], \"<=\"&$D$43+14, Table132[Type of Care], \"Direct/Indirect/Clinical Administration\")>= 90, (SUMIFS(Table132[Duration],Table132[Date (YYYY-MM-DD)], \"<=\"&$D$43+14, Table132[Type of Care], \"Direct/Indirect/Clinical Administration\")+ (IF(SUMIF(Table132[Type of Care], \"QI\", Table132[Duration])>= 4, 4,IF(SUMIF(Table132[Type of Care], \"QI\", Table132[Duration])<= 3, SUMIF(Table132[Type of Care], \"QI\", Table132[Duration]), 0))) -90)))","v":0},"A902"]
[]
[]
[null,{"$f":"IF(Clinic!C5=\"Jan - Mar\", \"March\", IF(Clinic!C5= \"Apr - June\", \"June\", IF(Clinic!C5=\"July - Sept\", \"September\", IF(Clinic!C5=\" Oct - Dec\", \"December\"))))","v":"March"},{"$f":"Clinic!C6","v":2021},{"$f":"DATE(YEAR(B86),MONTH(DATEVALUE(B83&\"1\")),1)","v":"1900-03-01"},null,null,null,"Month3"]
[]
[null,"Date (YYYY-MM-DD)","Day ","Type of Care","Start Time AM/PM","End Time AM/PM","Duration ","FALSE/TRUE"]
[null,null,{"$f":"IF(B86=\"\", \"\", B86)","v":""},null,null,null,null,{"$f":"IF( B86 > $D$83+14, SUMIFS($G$86:G86, $D$86:D86,\"Direct/Indirect/Clinical Administration\", $B$86:B86,\">\"&$D$83 + 14) + ((IF(SUMIF(Table1326[Type of Care], \"QI\", Table1326[[Duration ]])>= 4, 4,IF(SUMIF(Table1326[Type of Care], \"QI\", Table1326[[Duration ]])<= 3, SUMIF(Table1326[Type of Care], \"QI\", Table1326[[Duration ]]), 0))))  > 90, SUMIFS($G$86:G86, $D$86:D86,\"Direct/Indirect/Clinical Administration\",  $B$86:B86,\"<=\"&$D$83 + 14)+ ((IF(SUMIF(Table1326[Type of Care], \"QI\", Table1326[[Duration ]])>= 4, 4,IF(SUMIF(Table1326[Type of Care], \"QI\", Table1326[[Duration ]])<= 3, SUMIF(Table1326[Type of Care], \"QI\", Table1326[[Duration ]]), 0))))> 90)","v":false}]
[null,null,{"$f":"IF(B87=\"\", \"\", B87)","v":""},null,null,null,null,{"$f":"IF( B87 > $D$83+14, SUMIFS($G$86:G87, $D$86:D87,\"Direct/Indirect/Clinical Administration\", $B$86:B87,\">\"&$D$83 + 14) + ((IF(SUMIF(Table1326[Type of Care], \"QI\", Table1326[[Duration ]])>= 4, 4,IF(SUMIF(Table1326[Type of Care], \"QI\", Table1326[[Duration ]])<= 3, SUMIF(Table1326[Type of Care], \"QI\", Table1326[[Duration ]]), 0))))  > 90, SUMIFS($G$86:G87, $D$86:D87,\"Direct/Indirect/Clinical Administration\",  $B$86:B87,\"<=\"&$D$83 + 14)+ ((IF(SUMIF(Table1326[Type of Care], \"QI\", Table1326[[Duration ]])>= 4, 4,IF(SUMIF(Table1326[Type of Care], \"QI\", Table1326[[Duration ]])<= 3, SUMIF(Table1326[Type of Care], \"QI\", Table1326[[Duration ]]), 0))))> 90)","v":false}]
[null,null,{"$f":"IF(B88=\"\", \"\", B88)","v":""},null,null,null,null,{"$f":"IF( B88 > $D$83+14, SUMIFS($G$86:G88, $D$86:D88,\"Direct/Indirect/Clinical Administration\", $B$86:B88,\">\"&$D$83 + 14) + ((IF(SUMIF(Table1326[Type of Care], \"QI\", Table1326[[Duration ]])>= 4, 4,IF(SUMIF(Table1326[Type of Care], \"QI\", Table1326[[Duration ]])<= 3, SUMIF(Table1326[Type of Care], \"QI\", Table1326[[Duration ]]), 0))))  > 90, SUMIFS($G$86:G88, $D$86:D88,\"Direct/Indirect/Clinical Administration\",  $B$86:B88,\"<=\"&$D$83 + 14)+ ((IF(SUMIF(Table1326[Type of Care], \"QI\", Table1326[[Duration ]])>= 4, 4,IF(SUMIF(Table1326[Type of Care], \"QI\", Table1326[[Duration ]])<= 3, SUMIF(Table1326[Type of Care], \"QI\", Table1326[[Duration ]]), 0))))> 90)","v":false}]
[null,null,"",null,null,null,null,{"$f":"IF( B89 > $D$83+14, SUMIFS($G$86:G89, $D$86:D89,\"Direct/Indirect/Clinical Administration\", $B$86:B89,\">\"&$D$83 + 14) + ((IF(SUMIF(Table1326[Type of Care], \"QI\", Table1326[[Duration ]])>= 4, 4,IF(SUMIF(Table1326[Type of Care], \"QI\", Table1326[[Duration ]])<= 3, SUMIF(Table1326[Type of Care], \"QI\", Table1326[[Duration ]]), 0))))  > 90, SUMIFS($G$86:G89, $D$86:D89,\"Direct/Indirect/Clinical Administration\",  $B$86:B89,\"<=\"&$D$83 + 14)+ ((IF(SUMIF(Table1326[Type of Care], \"QI\", Table1326[[Duration ]])>= 4, 4,IF(SUMIF(Table1326[Type of Care], \"QI\", Table1326[[Duration ]])<= 3, SUMIF(Table1326[Type of Care], \"QI\", Table1326[[Duration ]]), 0))))> 90)","v":false}]
[null,null,"",null,null,null,null,{"$f":"IF( B90 > $D$83+14, SUMIFS($G$86:G90, $D$86:D90,\"Direct/Indirect/Clinical Administration\", $B$86:B90,\">\"&$D$83 + 14) + ((IF(SUMIF(Table1326[Type of Care], \"QI\", Table1326[[Duration ]])>= 4, 4,IF(SUMIF(Table1326[Type of Care], \"QI\", Table1326[[Duration ]])<= 3, SUMIF(Table1326[Type of Care], \"QI\", Table1326[[Duration ]]), 0))))  > 90, SUMIFS($G$86:G90, $D$86:D90,\"Direct/Indirect/Clinical Administration\",  $B$86:B90,\"<=\"&$D$83 + 14)+ ((IF(SUMIF(Table1326[Type of Care], \"QI\", Table1326[[Duration ]])>= 4, 4,IF(SUMIF(Table1326[Type of Care], \"QI\", Table1326[[Duration ]])<= 3, SUMIF(Table1326[Type of Care], \"QI\", Table1326[[Duration ]]), 0))))> 90)","v":false}]
[null,null,"",null,null,null,null,{"$f":"IF( B91 > $D$83+14, SUMIFS($G$86:G91, $D$86:D91,\"Direct/Indirect/Clinical Administration\", $B$86:B91,\">\"&$D$83 + 14) + ((IF(SUMIF(Table1326[Type of Care], \"QI\", Table1326[[Duration ]])>= 4, 4,IF(SUMIF(Table1326[Type of Care], \"QI\", Table1326[[Duration ]])<= 3, SUMIF(Table1326[Type of Care], \"QI\", Table1326[[Duration ]]), 0))))  > 90, SUMIFS($G$86:G91, $D$86:D91,\"Direct/Indirect/Clinical Administration\",  $B$86:B91,\"<=\"&$D$83 + 14)+ ((IF(SUMIF(Table1326[Type of Care], \"QI\", Table1326[[Duration ]])>= 4, 4,IF(SUMIF(Table1326[Type of Care], \"QI\", Table1326[[Duration ]])<= 3, SUMIF(Table1326[Type of Care], \"QI\", Table1326[[Duration ]]), 0))))> 90)","v":false}]
[null,null,"",null,null,null,null,{"$f":"IF( B92 > $D$83+14, SUMIFS($G$86:G92, $D$86:D92,\"Direct/Indirect/Clinical Administration\", $B$86:B92,\">\"&$D$83 + 14) + ((IF(SUMIF(Table1326[Type of Care], \"QI\", Table1326[[Duration ]])>= 4, 4,IF(SUMIF(Table1326[Type of Care], \"QI\", Table1326[[Duration ]])<= 3, SUMIF(Table1326[Type of Care], \"QI\", Table1326[[Duration ]]), 0))))  > 90, SUMIFS($G$86:G92, $D$86:D92,\"Direct/Indirect/Clinical Administration\",  $B$86:B92,\"<=\"&$D$83 + 14)+ ((IF(SUMIF(Table1326[Type of Care], \"QI\", Table1326[[Duration ]])>= 4, 4,IF(SUMIF(Table1326[Type of Care], \"QI\", Table1326[[Duration ]])<= 3, SUMIF(Table1326[Type of Care], \"QI\", Table1326[[Duration ]]), 0))))> 90)","v":false}]
[null,null,"",null,null,null,null,{"$f":"IF( B93 > $D$83+14, SUMIFS($G$86:G93, $D$86:D93,\"Direct/Indirect/Clinical Administration\", $B$86:B93,\">\"&$D$83 + 14) + ((IF(SUMIF(Table1326[Type of Care], \"QI\", Table1326[[Duration ]])>= 4, 4,IF(SUMIF(Table1326[Type of Care], \"QI\", Table1326[[Duration ]])<= 3, SUMIF(Table1326[Type of Care], \"QI\", Table1326[[Duration ]]), 0))))  > 90, SUMIFS($G$86:G93, $D$86:D93,\"Direct/Indirect/Clinical Administration\",  $B$86:B93,\"<=\"&$D$83 + 14)+ ((IF(SUMIF(Table1326[Type of Care], \"QI\", Table1326[[Duration ]])>= 4, 4,IF(SUMIF(Table1326[Type of Care], \"QI\", Table1326[[Duration ]])<= 3, SUMIF(Table1326[Type of Care], \"QI\", Table1326[[Duration ]]), 0))))> 90)","v":false}]
[null,null,"",null,null,null,null,{"$f":"IF( B94 > $D$83+14, SUMIFS($G$86:G94, $D$86:D94,\"Direct/Indirect/Clinical Administration\", $B$86:B94,\">\"&$D$83 + 14) + ((IF(SUMIF(Table1326[Type of Care], \"QI\", Table1326[[Duration ]])>= 4, 4,IF(SUMIF(Table1326[Type of Care], \"QI\", Table1326[[Duration ]])<= 3, SUMIF(Table1326[Type of Care], \"QI\", Table1326[[Duration ]]), 0))))  > 90, SUMIFS($G$86:G94, $D$86:D94,\"Direct/Indirect/Clinical Administration\",  $B$86:B94,\"<=\"&$D$83 + 14)+ ((IF(SUMIF(Table1326[Type of Care], \"QI\", Table1326[[Duration ]])>= 4, 4,IF(SUMIF(Table1326[Type of Care], \"QI\", Table1326[[Duration ]])<= 3, SUMIF(Table1326[Type of Care], \"QI\", Table1326[[Duration ]]), 0))))> 90)","v":false}]
[null,null,"",null,null,null,null,{"$f":"IF( B95 > $D$83+14, SUMIFS($G$86:G95, $D$86:D95,\"Direct/Indirect/Clinical Administration\", $B$86:B95,\">\"&$D$83 + 14) + ((IF(SUMIF(Table1326[Type of Care], \"QI\", Table1326[[Duration ]])>= 4, 4,IF(SUMIF(Table1326[Type of Care], \"QI\", Table1326[[Duration ]])<= 3, SUMIF(Table1326[Type of Care], \"QI\", Table1326[[Duration ]]), 0))))  > 90, SUMIFS($G$86:G95, $D$86:D95,\"Direct/Indirect/Clinical Administration\",  $B$86:B95,\"<=\"&$D$83 + 14)+ ((IF(SUMIF(Table1326[Type of Care], \"QI\", Table1326[[Duration ]])>= 4, 4,IF(SUMIF(Table1326[Type of Care], \"QI\", Table1326[[Duration ]])<= 3, SUMIF(Table1326[Type of Care], \"QI\", Table1326[[Duration ]]), 0))))> 90)","v":false}]
[null,null,"",null,null,null,null,{"$f":"IF( B96 > $D$83+14, SUMIFS($G$86:G96, $D$86:D96,\"Direct/Indirect/Clinical Administration\", $B$86:B96,\">\"&$D$83 + 14) + ((IF(SUMIF(Table1326[Type of Care], \"QI\", Table1326[[Duration ]])>= 4, 4,IF(SUMIF(Table1326[Type of Care], \"QI\", Table1326[[Duration ]])<= 3, SUMIF(Table1326[Type of Care], \"QI\", Table1326[[Duration ]]), 0))))  > 90, SUMIFS($G$86:G96, $D$86:D96,\"Direct/Indirect/Clinical Administration\",  $B$86:B96,\"<=\"&$D$83 + 14)+ ((IF(SUMIF(Table1326[Type of Care], \"QI\", Table1326[[Duration ]])>= 4, 4,IF(SUMIF(Table1326[Type of Care], \"QI\", Table1326[[Duration ]])<= 3, SUMIF(Table1326[Type of Care], \"QI\", Table1326[[Duration ]]), 0))))> 90)","v":false}]
[null,null,"",null,null,null,null,{"$f":"IF( B97 > $D$83+14, SUMIFS($G$86:G97, $D$86:D97,\"Direct/Indirect/Clinical Administration\", $B$86:B97,\">\"&$D$83 + 14) + ((IF(SUMIF(Table1326[Type of Care], \"QI\", Table1326[[Duration ]])>= 4, 4,IF(SUMIF(Table1326[Type of Care], \"QI\", Table1326[[Duration ]])<= 3, SUMIF(Table1326[Type of Care], \"QI\", Table1326[[Duration ]]), 0))))  > 90, SUMIFS($G$86:G97, $D$86:D97,\"Direct/Indirect/Clinical Administration\",  $B$86:B97,\"<=\"&$D$83 + 14)+ ((IF(SUMIF(Table1326[Type of Care], \"QI\", Table1326[[Duration ]])>= 4, 4,IF(SUMIF(Table1326[Type of Care], \"QI\", Table1326[[Duration ]])<= 3, SUMIF(Table1326[Type of Care], \"QI\", Table1326[[Duration ]]), 0))))> 90)","v":false}]
[null,null,{"$f":"IF(B98=\"\", \"\", B98)","v":""},null,null,null,null,{"$f":"IF( B98 > $D$83+14, SUMIFS($G$86:G98, $D$86:D98,\"Direct/Indirect/Clinical Administration\", $B$86:B98,\">\"&$D$83 + 14) + ((IF(SUMIF(Table1326[Type of Care], \"QI\", Table1326[[Duration ]])>= 4, 4,IF(SUMIF(Table1326[Type of Care], \"QI\", Table1326[[Duration ]])<= 3, SUMIF(Table1326[Type of Care], \"QI\", Table1326[[Duration ]]), 0))))  > 90, SUMIFS($G$86:G98, $D$86:D98,\"Direct/Indirect/Clinical Administration\",  $B$86:B98,\"<=\"&$D$83 + 14)+ ((IF(SUMIF(Table1326[Type of Care], \"QI\", Table1326[[Duration ]])>= 4, 4,IF(SUMIF(Table1326[Type of Care], \"QI\", Table1326[[Duration ]])<= 3, SUMIF(Table1326[Type of Care], \"QI\", Table1326[[Duration ]]), 0))))> 90)","v":false}]
[null,null,{"$f":"IF(B99=\"\", \"\", B99)","v":""},null,null,null,null,{"$f":"IF( B99 > $D$83+14, SUMIFS($G$86:G99, $D$86:D99,\"Direct/Indirect/Clinical Administration\", $B$86:B99,\">\"&$D$83 + 14) + ((IF(SUMIF(Table1326[Type of Care], \"QI\", Table1326[[Duration ]])>= 4, 4,IF(SUMIF(Table1326[Type of Care], \"QI\", Table1326[[Duration ]])<= 3, SUMIF(Table1326[Type of Care], \"QI\", Table1326[[Duration ]]), 0))))  > 90, SUMIFS($G$86:G99, $D$86:D99,\"Direct/Indirect/Clinical Administration\",  $B$86:B99,\"<=\"&$D$83 + 14)+ ((IF(SUMIF(Table1326[Type of Care], \"QI\", Table1326[[Duration ]])>= 4, 4,IF(SUMIF(Table1326[Type of Care], \"QI\", Table1326[[Duration ]])<= 3, SUMIF(Table1326[Type of Care], \"QI\", Table1326[[Duration ]]), 0))))> 90)","v":false}]
[null,null,{"$f":"IF(B100=\"\", \"\", B100)","v":""},null,null,null,null,{"$f":"IF( B100 > $D$83+14, SUMIFS($G$86:G100, $D$86:D100,\"Direct/Indirect/Clinical Administration\", $B$86:B100,\">\"&$D$83 + 14) + ((IF(SUMIF(Table1326[Type of Care], \"QI\", Table1326[[Duration ]])>= 4, 4,IF(SUMIF(Table1326[Type of Care], \"QI\", Table1326[[Duration ]])<= 3, SUMIF(Table1326[Type of Care], \"QI\", Table1326[[Duration ]]), 0))))  > 90, SUMIFS($G$86:G100, $D$86:D100,\"Direct/Indirect/Clinical Administration\",  $B$86:B100,\"<=\"&$D$83 + 14)+ ((IF(SUMIF(Table1326[Type of Care], \"QI\", Table1326[[Duration ]])>= 4, 4,IF(SUMIF(Table1326[Type of Care], \"QI\", Table1326[[Duration ]])<= 3, SUMIF(Table1326[Type of Care], \"QI\", Table1326[[Duration ]]), 0))))> 90)","v":false}]
[null,null,"",null,null,null,null,{"$f":"IF( B101 > $D$83+14, SUMIFS($G$86:G101, $D$86:D101,\"Direct/Indirect/Clinical Administration\", $B$86:B101,\">\"&$D$83 + 14) + ((IF(SUMIF(Table1326[Type of Care], \"QI\", Table1326[[Duration ]])>= 4, 4,IF(SUMIF(Table1326[Type of Care], \"QI\", Table1326[[Duration ]])<= 3, SUMIF(Table1326[Type of Care], \"QI\", Table1326[[Duration ]]), 0))))  > 90, SUMIFS($G$86:G101, $D$86:D101,\"Direct/Indirect/Clinical Administration\",  $B$86:B101,\"<=\"&$D$83 + 14)+ ((IF(SUMIF(Table1326[Type of Care], \"QI\", Table1326[[Duration ]])>= 4, 4,IF(SUMIF(Table1326[Type of Care], \"QI\", Table1326[[Duration ]])<= 3, SUMIF(Table1326[Type of Care], \"QI\", Table1326[[Duration ]]), 0))))> 90)","v":false}]
[null,null,"",null,null,null,null,{"$f":"IF( B102 > $D$83+14, SUMIFS($G$86:G102, $D$86:D102,\"Direct/Indirect/Clinical Administration\", $B$86:B102,\">\"&$D$83 + 14) + ((IF(SUMIF(Table1326[Type of Care], \"QI\", Table1326[[Duration ]])>= 4, 4,IF(SUMIF(Table1326[Type of Care], \"QI\", Table1326[[Duration ]])<= 3, SUMIF(Table1326[Type of Care], \"QI\", Table1326[[Duration ]]), 0))))  > 90, SUMIFS($G$86:G102, $D$86:D102,\"Direct/Indirect/Clinical Administration\",  $B$86:B102,\"<=\"&$D$83 + 14)+ ((IF(SUMIF(Table1326[Type of Care], \"QI\", Table1326[[Duration ]])>= 4, 4,IF(SUMIF(Table1326[Type of Care], \"QI\", Table1326[[Duration ]])<= 3, SUMIF(Table1326[Type of Care], \"QI\", Table1326[[Duration ]]), 0))))> 90)","v":false}]
[null,null,"",null,null,null,null,{"$f":"IF( B103 > $D$83+14, SUMIFS($G$86:G103, $D$86:D103,\"Direct/Indirect/Clinical Administration\", $B$86:B103,\">\"&$D$83 + 14) + ((IF(SUMIF(Table1326[Type of Care], \"QI\", Table1326[[Duration ]])>= 4, 4,IF(SUMIF(Table1326[Type of Care], \"QI\", Table1326[[Duration ]])<= 3, SUMIF(Table1326[Type of Care], \"QI\", Table1326[[Duration ]]), 0))))  > 90, SUMIFS($G$86:G103, $D$86:D103,\"Direct/Indirect/Clinical Administration\",  $B$86:B103,\"<=\"&$D$83 + 14)+ ((IF(SUMIF(Table1326[Type of Care], \"QI\", Table1326[[Duration ]])>= 4, 4,IF(SUMIF(Table1326[Type of Care], \"QI\", Table1326[[Duration ]])<= 3, SUMIF(Table1326[Type of Care], \"QI\", Table1326[[Duration ]]), 0))))> 90)","v":false}]
[null,null,"",null,null,null,null,{"$f":"IF( B104 > $D$83+14, SUMIFS($G$86:G104, $D$86:D104,\"Direct/Indirect/Clinical Administration\", $B$86:B104,\">\"&$D$83 + 14) + ((IF(SUMIF(Table1326[Type of Care], \"QI\", Table1326[[Duration ]])>= 4, 4,IF(SUMIF(Table1326[Type of Care], \"QI\", Table1326[[Duration ]])<= 3, SUMIF(Table1326[Type of Care], \"QI\", Table1326[[Duration ]]), 0))))  > 90, SUMIFS($G$86:G104, $D$86:D104,\"Direct/Indirect/Clinical Administration\",  $B$86:B104,\"<=\"&$D$83 + 14)+ ((IF(SUMIF(Table1326[Type of Care], \"QI\", Table1326[[Duration ]])>= 4, 4,IF(SUMIF(Table1326[Type of Care], \"QI\", Table1326[[Duration ]])<= 3, SUMIF(Table1326[Type of Care], \"QI\", Table1326[[Duration ]]), 0))))> 90)","v":false}]
[null,null,"",null,null,null,null,{"$f":"IF( B105 > $D$83+14, SUMIFS($G$86:G105, $D$86:D105,\"Direct/Indirect/Clinical Administration\", $B$86:B105,\">\"&$D$83 + 14) + ((IF(SUMIF(Table1326[Type of Care], \"QI\", Table1326[[Duration ]])>= 4, 4,IF(SUMIF(Table1326[Type of Care], \"QI\", Table1326[[Duration ]])<= 3, SUMIF(Table1326[Type of Care], \"QI\", Table1326[[Duration ]]), 0))))  > 90, SUMIFS($G$86:G105, $D$86:D105,\"Direct/Indirect/Clinical Administration\",  $B$86:B105,\"<=\"&$D$83 + 14)+ ((IF(SUMIF(Table1326[Type of Care], \"QI\", Table1326[[Duration ]])>= 4, 4,IF(SUMIF(Table1326[Type of Care], \"QI\", Table1326[[Duration ]])<= 3, SUMIF(Table1326[Type of Care], \"QI\", Table1326[[Duration ]]), 0))))> 90)","v":false}]
[null,null,"",null,null,null,null,{"$f":"IF( B106 > $D$83+14, SUMIFS($G$86:G106, $D$86:D106,\"Direct/Indirect/Clinical Administration\", $B$86:B106,\">\"&$D$83 + 14) + ((IF(SUMIF(Table1326[Type of Care], \"QI\", Table1326[[Duration ]])>= 4, 4,IF(SUMIF(Table1326[Type of Care], \"QI\", Table1326[[Duration ]])<= 3, SUMIF(Table1326[Type of Care], \"QI\", Table1326[[Duration ]]), 0))))  > 90, SUMIFS($G$86:G106, $D$86:D106,\"Direct/Indirect/Clinical Administration\",  $B$86:B106,\"<=\"&$D$83 + 14)+ ((IF(SUMIF(Table1326[Type of Care], \"QI\", Table1326[[Duration ]])>= 4, 4,IF(SUMIF(Table1326[Type of Care], \"QI\", Table1326[[Duration ]])<= 3, SUMIF(Table1326[Type of Care], \"QI\", Table1326[[Duration ]]), 0))))> 90)","v":false}]
[null,null,"",null,null,null,null,{"$f":"IF( B107 > $D$83+14, SUMIFS($G$86:G107, $D$86:D107,\"Direct/Indirect/Clinical Administration\", $B$86:B107,\">\"&$D$83 + 14) + ((IF(SUMIF(Table1326[Type of Care], \"QI\", Table1326[[Duration ]])>= 4, 4,IF(SUMIF(Table1326[Type of Care], \"QI\", Table1326[[Duration ]])<= 3, SUMIF(Table1326[Type of Care], \"QI\", Table1326[[Duration ]]), 0))))  > 90, SUMIFS($G$86:G107, $D$86:D107,\"Direct/Indirect/Clinical Administration\",  $B$86:B107,\"<=\"&$D$83 + 14)+ ((IF(SUMIF(Table1326[Type of Care], \"QI\", Table1326[[Duration ]])>= 4, 4,IF(SUMIF(Table1326[Type of Care], \"QI\", Table1326[[Duration ]])<= 3, SUMIF(Table1326[Type of Care], \"QI\", Table1326[[Duration ]]), 0))))> 90)","v":false}]
[null,null,"",null,null,null,null,{"$f":"IF( B108 > $D$83+14, SUMIFS($G$86:G108, $D$86:D108,\"Direct/Indirect/Clinical Administration\", $B$86:B108,\">\"&$D$83 + 14) + ((IF(SUMIF(Table1326[Type of Care], \"QI\", Table1326[[Duration ]])>= 4, 4,IF(SUMIF(Table1326[Type of Care], \"QI\", Table1326[[Duration ]])<= 3, SUMIF(Table1326[Type of Care], \"QI\", Table1326[[Duration ]]), 0))))  > 90, SUMIFS($G$86:G108, $D$86:D108,\"Direct/Indirect/Clinical Administration\",  $B$86:B108,\"<=\"&$D$83 + 14)+ ((IF(SUMIF(Table1326[Type of Care], \"QI\", Table1326[[Duration ]])>= 4, 4,IF(SUMIF(Table1326[Type of Care], \"QI\", Table1326[[Duration ]])<= 3, SUMIF(Table1326[Type of Care], \"QI\", Table1326[[Duration ]]), 0))))> 90)","v":false}]
[null,null,"",null,null,null,null,{"$f":"IF( B109 > $D$83+14, SUMIFS($G$86:G109, $D$86:D109,\"Direct/Indirect/Clinical Administration\", $B$86:B109,\">\"&$D$83 + 14) + ((IF(SUMIF(Table1326[Type of Care], \"QI\", Table1326[[Duration ]])>= 4, 4,IF(SUMIF(Table1326[Type of Care], \"QI\", Table1326[[Duration ]])<= 3, SUMIF(Table1326[Type of Care], \"QI\", Table1326[[Duration ]]), 0))))  > 90, SUMIFS($G$86:G109, $D$86:D109,\"Direct/Indirect/Clinical Administration\",  $B$86:B109,\"<=\"&$D$83 + 14)+ ((IF(SUMIF(Table1326[Type of Care], \"QI\", Table1326[[Duration ]])>= 4, 4,IF(SUMIF(Table1326[Type of Care], \"QI\", Table1326[[Duration ]])<= 3, SUMIF(Table1326[Type of Care], \"QI\", Table1326[[Duration ]]), 0))))> 90)","v":false}]
[null,null,"",null,null,null,null,{"$f":"IF( B110 > $D$83+14, SUMIFS($G$86:G110, $D$86:D110,\"Direct/Indirect/Clinical Administration\", $B$86:B110,\">\"&$D$83 + 14) + ((IF(SUMIF(Table1326[Type of Care], \"QI\", Table1326[[Duration ]])>= 4, 4,IF(SUMIF(Table1326[Type of Care], \"QI\", Table1326[[Duration ]])<= 3, SUMIF(Table1326[Type of Care], \"QI\", Table1326[[Duration ]]), 0))))  > 90, SUMIFS($G$86:G110, $D$86:D110,\"Direct/Indirect/Clinical Administration\",  $B$86:B110,\"<=\"&$D$83 + 14)+ ((IF(SUMIF(Table1326[Type of Care], \"QI\", Table1326[[Duration ]])>= 4, 4,IF(SUMIF(Table1326[Type of Care], \"QI\", Table1326[[Duration ]])<= 3, SUMIF(Table1326[Type of Care], \"QI\", Table1326[[Duration ]]), 0))))> 90)","v":false}]
[null,null,"",null,null,null,null,{"$f":"IF( B111 > $D$83+14, SUMIFS($G$86:G111, $D$86:D111,\"Direct/Indirect/Clinical Administration\", $B$86:B111,\">\"&$D$83 + 14) + ((IF(SUMIF(Table1326[Type of Care], \"QI\", Table1326[[Duration ]])>= 4, 4,IF(SUMIF(Table1326[Type of Care], \"QI\", Table1326[[Duration ]])<= 3, SUMIF(Table1326[Type of Care], \"QI\", Table1326[[Duration ]]), 0))))  > 90, SUMIFS($G$86:G111, $D$86:D111,\"Direct/Indirect/Clinical Administration\",  $B$86:B111,\"<=\"&$D$83 + 14)+ ((IF(SUMIF(Table1326[Type of Care], \"QI\", Table1326[[Duration ]])>= 4, 4,IF(SUMIF(Table1326[Type of Care], \"QI\", Table1326[[Duration ]])<= 3, SUMIF(Table1326[Type of Care], \"QI\", Table1326[[Duration ]]), 0))))> 90)","v":false}]
[null,null,"",null,null,null,null,{"$f":"IF( B112 > $D$83+14, SUMIFS($G$86:G112, $D$86:D112,\"Direct/Indirect/Clinical Administration\", $B$86:B112,\">\"&$D$83 + 14) + ((IF(SUMIF(Table1326[Type of Care], \"QI\", Table1326[[Duration ]])>= 4, 4,IF(SUMIF(Table1326[Type of Care], \"QI\", Table1326[[Duration ]])<= 3, SUMIF(Table1326[Type of Care], \"QI\", Table1326[[Duration ]]), 0))))  > 90, SUMIFS($G$86:G112, $D$86:D112,\"Direct/Indirect/Clinical Administration\",  $B$86:B112,\"<=\"&$D$83 + 14)+ ((IF(SUMIF(Table1326[Type of Care], \"QI\", Table1326[[Duration ]])>= 4, 4,IF(SUMIF(Table1326[Type of Care], \"QI\", Table1326[[Duration ]])<= 3, SUMIF(Table1326[Type of Care], \"QI\", Table1326[[Duration ]]), 0))))> 90)","v":false}]
[null,null,"",null,null,null,null,{"$f":"IF( B113 > $D$83+14, SUMIFS($G$86:G113, $D$86:D113,\"Direct/Indirect/Clinical Administration\", $B$86:B113,\">\"&$D$83 + 14) + ((IF(SUMIF(Table1326[Type of Care], \"QI\", Table1326[[Duration ]])>= 4, 4,IF(SUMIF(Table1326[Type of Care], \"QI\", Table1326[[Duration ]])<= 3, SUMIF(Table1326[Type of Care], \"QI\", Table1326[[Duration ]]), 0))))  > 90, SUMIFS($G$86:G113, $D$86:D113,\"Direct/Indirect/Clinical Administration\",  $B$86:B113,\"<=\"&$D$83 + 14)+ ((IF(SUMIF(Table1326[Type of Care], \"QI\", Table1326[[Duration ]])>= 4, 4,IF(SUMIF(Table1326[Type of Care], \"QI\", Table1326[[Duration ]])<= 3, SUMIF(Table1326[Type of Care], \"QI\", Table1326[[Duration ]]), 0))))> 90)","v":false}]
[null,null,{"$f":"IF(B114=\"\", \"\", B114)","v":""},null,null,null,null,{"$f":"IF( B114 > $D$83+14, SUMIFS($G$86:G114, $D$86:D114,\"Direct/Indirect/Clinical Administration\", $B$86:B114,\">\"&$D$83 + 14) + ((IF(SUMIF(Table1326[Type of Care], \"QI\", Table1326[[Duration ]])>= 4, 4,IF(SUMIF(Table1326[Type of Care], \"QI\", Table1326[[Duration ]])<= 3, SUMIF(Table1326[Type of Care], \"QI\", Table1326[[Duration ]]), 0))))  > 90, SUMIFS($G$86:G114, $D$86:D114,\"Direct/Indirect/Clinical Administration\",  $B$86:B114,\"<=\"&$D$83 + 14)+ ((IF(SUMIF(Table1326[Type of Care], \"QI\", Table1326[[Duration ]])>= 4, 4,IF(SUMIF(Table1326[Type of Care], \"QI\", Table1326[[Duration ]])<= 3, SUMIF(Table1326[Type of Care], \"QI\", Table1326[[Duration ]]), 0))))> 90)","v":false}]
[null,null,{"$f":"IF(B115=\"\", \"\", B115)","v":""},null,null,"Total Contract Hours",{"$f":"(SUMIF(Table1326[Type of Care], \"Direct/Indirect/Clinical Administration\",Table1326[[Duration ]]))","v":0},"CT3"]
[null,null,null,null,null,"Total Included QI Hours",{"$f":"(IF(SUMIF(Table1326[Type of Care], \"QI\", Table1326[[Duration ]])>= 4, 4,IF(SUMIF(Table1326[Type of Care], \"QI\", Table1326[[Duration ]])<= 3, SUMIF(Table1326[Type of Care], \"QI\", Table1326[[Duration ]]), 0)))","v":0},"QI3"]
[null,null,null,null,null,"Total Excluded Hours",{"$f":"G118+G119","v":0},"EX3"]
[null,null,null,null,null,"         Excluded Contract Hours",{"$f":"(SUMIF(Table1326[Type of Care], \"Third Party/Specialist FFS\",Table1326[[Duration ]])) + (SUMIF(Table1326[Type of Care], \"Break (>15 Minutes)\", Table1326[[Duration ]]))","v":0},"EXC3"]
[null,null,null,null,null,"      Excluded QI Hours",{"$f":"(SUMIF(Table1326[Type of Care], \"QI\", Table1326[[Duration ]]) - (IF(SUMIF(Table1326[Type of Care], \"QI\", Table1326[[Duration ]])>= 4, 4,IF(SUMIF(Table1326[Type of Care], \"QI\", Table1326[[Duration ]])<= 3, SUMIF(Table1326[Type of Care], \"QI\", Table1326[[Duration ]]), 0))))","v":0},"EXQI3"]
[null,null,{"$f":"IF(B120=\"\", \"\", B120)","v":""},null,null,"Hours Above 90hr/semi-monthly",{"$f":"  (IF(SUMIFS(Table1326[[Duration ]],Table1326[Date (YYYY-MM-DD)], \">\"&$D$43+14, Table1326[Type of Care], \"Direct/Indirect/Clinical Administration\")>= 90, (SUMIFS(Table1326[[Duration ]],Table1326[Date (YYYY-MM-DD)], \">\"&$D$43+14, Table1326[Type of Care], \"Direct/Indirect/Clinical Administration\")+ (IF(SUMIF(Table1326[Type of Care], \"QI\", Table1326[[Duration ]])>= 4, 4,IF(SUMIF(Table1326[Type of Care], \"QI\", Table1326[[Duration ]])<= 3, SUMIF(Table1326[Type of Care], \"QI\",Table1326[[Duration ]]), 0))) -90))) + (IF(SUMIFS(Table1326[[Duration ]],Table1326[Date (YYYY-MM-DD)], \"<=\"&$D$43+14, Table1326[Type of Care], \"Direct/Indirect/Clinical Administration\")>= 90, (SUMIFS(Table1326[[Duration ]],Table1326[Date (YYYY-MM-DD)], \"<=\"&$D$43+14, Table1326[Type of Care], \"Direct/Indirect/Clinical Administration\")+ (IF(SUMIF(Table1326[Type of Care], \"QI\", Table1326[[Duration ]])>= 4, 4,IF(SUMIF(Table1326[Type of Care], \"QI\", Table1326[[Duration ]])<= 3, SUMIF(Table1326[Type of Care], \"QI\",Table1326[[Duration ]]), 0))) -90)))","v":0},"A903"]

{"sheet":"Physician 2","index":2,"n_rows":120,"n_cols":8,"rows_kept":120,"cut":false,"hidden":false,"merged":[]}
[]
[null,"[Physician Name]"]
[null,"Practitioner #:",0]
[null,"Annual Rate: ",0]
[null,"Qrt. Disbursement: ",0]
[null,null,"Jan - Mar"]
[null,"Total Contract \nHours","Total Included \nQI Hours","Excluded Contract \nHours"]
[null,{"$f":"G35+G75+G115","v":0},{"$f":"G36+G76+G116","v":0},{"$f":"G37+G77+G117","v":0},null,null,null,"Totals"]
[]
[null,{"$f":"IF(Clinic!C5=\"Jan - Mar\", \"January\", IF(Clinic!C5= \"Apr - June\", \"April\", IF(Clinic!C5=\"July - Sept\", \"July\", IF(Clinic!C5=\" Oct - Dec\", \"October\"))))","v":"January"},{"$f":"Clinic!C6","v":2021},{"$f":"DATE(YEAR(B13),MONTH(DATEVALUE(B10&\"1\")),1)","v":"1900-01-01"},null,null,null,"Month1"]
[]
[null,"Date (YYYY-MM-DD)","Day ","Type of Care","Start Time AM/PM","End Time AM/PM","Duration","FALSE/TRUE"]
[null,null,{"$f":"IF(B13=\"\", \"\", B13)","v":""},null,null,null,null,{"$f":"IF( B13 > $D$10+14, SUMIFS($G$13:G13, $D$13:D13,\"Direct/Indirect/Clinical Administration\", $B$13:B13,\">\"&$D$10 + 14) + ((IF(SUMIF(Table1315[Type of Care], \"QI\", Table1315[Duration])>= 4, 4,IF(SUMIF(Table1315[Type of Care], \"QI\", Table1315[Duration])<= 3, SUMIF(Table1315[Type of Care], \"QI\", Table1315[Duration]), 0))))  > 90, SUMIFS($G$13:G13, $D$13:D13,\"Direct/Indirect/Clinical Administration\",  $B$13:B13,\"<=\"&$D$10 + 14)+ ((IF(SUMIF(Table1315[Type of Care], \"QI\", Table1315[Duration])>= 4, 4,IF(SUMIF(Table1315[Type of Care], \"QI\", Table1315[Duration])<= 3, SUMIF(Table1315[Type of Care], \"QI\", Table1315[Duration]), 0))))> 90)","v":false}]
[null,null,{"$f":"IF(B14=\"\", \"\", B14)","v":""},null,null,null,null,{"$f":"IF( B14 > $D$10+14, SUMIFS($G$13:G14, $D$13:D14,\"Direct/Indirect/Clinical Administration\", $B$13:B14,\">\"&$D$10 + 14) + ((IF(SUMIF(Table1315[Type of Care], \"QI\", Table1315[Duration])>= 4, 4,IF(SUMIF(Table1315[Type of Care], \"QI\", Table1315[Duration])<= 3, SUMIF(Table1315[Type of Care], \"QI\", Table1315[Duration]), 0))))  > 90, SUMIFS($G$13:G14, $D$13:D14,\"Direct/Indirect/Clinical Administration\",  $B$13:B14,\"<=\"&$D$10 + 14)+ ((IF(SUMIF(Table1315[Type of Care], \"QI\", Table1315[Duration])>= 4, 4,IF(SUMIF(Table1315[Type of Care], \"QI\", Table1315[Duration])<= 3, SUMIF(Table1315[Type of Care], \"QI\", Table1315[Duration]), 0))))> 90)","v":false}]
[null,null,"",null,null,null,null,{"$f":"IF( B15 > $D$10+14, SUMIFS($G$13:G15, $D$13:D15,\"Direct/Indirect/Clinical Administration\", $B$13:B15,\">\"&$D$10 + 14) + ((IF(SUMIF(Table1315[Type of Care], \"QI\", Table1315[Duration])>= 4, 4,IF(SUMIF(Table1315[Type of Care], \"QI\", Table1315[Duration])<= 3, SUMIF(Table1315[Type of Care], \"QI\", Table1315[Duration]), 0))))  > 90, SUMIFS($G$13:G15, $D$13:D15,\"Direct/Indirect/Clinical Administration\",  $B$13:B15,\"<=\"&$D$10 + 14)+ ((IF(SUMIF(Table1315[Type of Care], \"QI\", Table1315[Duration])>= 4, 4,IF(SUMIF(Table1315[Type of Care], \"QI\", Table1315[Duration])<= 3, SUMIF(Table1315[Type of Care], \"QI\", Table1315[Duration]), 0))))> 90)","v":false}]
[null,null,"",null,null,null,null,{"$f":"IF( B16 > $D$10+14, SUMIFS($G$13:G16, $D$13:D16,\"Direct/Indirect/Clinical Administration\", $B$13:B16,\">\"&$D$10 + 14) + ((IF(SUMIF(Table1315[Type of Care], \"QI\", Table1315[Duration])>= 4, 4,IF(SUMIF(Table1315[Type of Care], \"QI\", Table1315[Duration])<= 3, SUMIF(Table1315[Type of Care], \"QI\", Table1315[Duration]), 0))))  > 90, SUMIFS($G$13:G16, $D$13:D16,\"Direct/Indirect/Clinical Administration\",  $B$13:B16,\"<=\"&$D$10 + 14)+ ((IF(SUMIF(Table1315[Type of Care], \"QI\", Table1315[Duration])>= 4, 4,IF(SUMIF(Table1315[Type of Care], \"QI\", Table1315[Duration])<= 3, SUMIF(Table1315[Type of Care], \"QI\", Table1315[Duration]), 0))))> 90)","v":false}]
[null,null,{"$f":"IF(B17=\"\", \"\", B17)","v":""},null,null,null,null,{"$f":"IF( B17 > $D$10+14, SUMIFS($G$13:G17, $D$13:D17,\"Direct/Indirect/Clinical Administration\", $B$13:B17,\">\"&$D$10 + 14) + ((IF(SUMIF(Table1315[Type of Care], \"QI\", Table1315[Duration])>= 4, 4,IF(SUMIF(Table1315[Type of Care], \"QI\", Table1315[Duration])<= 3, SUMIF(Table1315[Type of Care], \"QI\", Table1315[Duration]), 0))))  > 90, SUMIFS($G$13:G17, $D$13:D17,\"Direct/Indirect/Clinical Administration\",  $B$13:B17,\"<=\"&$D$10 + 14)+ ((IF(SUMIF(Table1315[Type of Care], \"QI\", Table1315[Duration])>= 4, 4,IF(SUMIF(Table1315[Type of Care], \"QI\", Table1315[Duration])<= 3, SUMIF(Table1315[Type of Care], \"QI\", Table1315[Duration]), 0))))> 90)","v":false}]
[null,null,"",null,null,null,null,{"$f":"IF( B18 > $D$10+14, SUMIFS($G$13:G18, $D$13:D18,\"Direct/Indirect/Clinical Administration\", $B$13:B18,\">\"&$D$10 + 14) + ((IF(SUMIF(Table1315[Type of Care], \"QI\", Table1315[Duration])>= 4, 4,IF(SUMIF(Table1315[Type of Care], \"QI\", Table1315[Duration])<= 3, SUMIF(Table1315[Type of Care], \"QI\", Table1315[Duration]), 0))))  > 90, SUMIFS($G$13:G18, $D$13:D18,\"Direct/Indirect/Clinical Administration\",  $B$13:B18,\"<=\"&$D$10 + 14)+ ((IF(SUMIF(Table1315[Type of Care], \"QI\", Table1315[Duration])>= 4, 4,IF(SUMIF(Table1315[Type of Care], \"QI\", Table1315[Duration])<= 3, SUMIF(Table1315[Type of Care], \"QI\", Table1315[Duration]), 0))))> 90)","v":false}]
[null,null,"",null,null,null,null,{"$f":"IF( B19 > $D$10+14, SUMIFS($G$13:G19, $D$13:D19,\"Direct/Indirect/Clinical Administration\", $B$13:B19,\">\"&$D$10 + 14) + ((IF(SUMIF(Table1315[Type of Care], \"QI\", Table1315[Duration])>= 4, 4,IF(SUMIF(Table1315[Type of Care], \"QI\", Table1315[Duration])<= 3, SUMIF(Table1315[Type of Care], \"QI\", Table1315[Duration]), 0))))  > 90, SUMIFS($G$13:G19, $D$13:D19,\"Direct/Indirect/Clinical Administration\",  $B$13:B19,\"<=\"&$D$10 + 14)+ ((IF(SUMIF(Table1315[Type of Care], \"QI\", Table1315[Duration])>= 4, 4,IF(SUMIF(Table1315[Type of Care], \"QI\", Table1315[Duration])<= 3, SUMIF(Table1315[Type of Care], \"QI\", Table1315[Duration]), 0))))> 90)","v":false}]
[null,null,"",null,null,null,null,{"$f":"IF( B20 > $D$10+14, SUMIFS($G$13:G20, $D$13:D20,\"Direct/Indirect/Clinical Administration\", $B$13:B20,\">\"&$D$10 + 14) + ((IF(SUMIF(Table1315[Type of Care], \"QI\", Table1315[Duration])>= 4, 4,IF(SUMIF(Table1315[Type of Care], \"QI\", Table1315[Duration])<= 3, SUMIF(Table1315[Type of Care], \"QI\", Table1315[Duration]), 0))))  > 90, SUMIFS($G$13:G20, $D$13:D20,\"Direct/Indirect/Clinical Administration\",  $B$13:B20,\"<=\"&$D$10 + 14)+ ((IF(SUMIF(Table1315[Type of Care], \"QI\", Table1315[Duration])>= 4, 4,IF(SUMIF(Table1315[Type of Care], \"QI\", Table1315[Duration])<= 3, SUMIF(Table1315[Type of Care], \"QI\", Table1315[Duration]), 0))))> 90)","v":false}]
[null,null,"",null,null,null,null,{"$f":"IF( B21 > $D$10+14, SUMIFS($G$13:G21, $D$13:D21,\"Direct/Indirect/Clinical Administration\", $B$13:B21,\">\"&$D$10 + 14) + ((IF(SUMIF(Table1315[Type of Care], \"QI\", Table1315[Duration])>= 4, 4,IF(SUMIF(Table1315[Type of Care], \"QI\", Table1315[Duration])<= 3, SUMIF(Table1315[Type of Care], \"QI\", Table1315[Duration]), 0))))  > 90, SUMIFS($G$13:G21, $D$13:D21,\"Direct/Indirect/Clinical Administration\",  $B$13:B21,\"<=\"&$D$10 + 14)+ ((IF(SUMIF(Table1315[Type of Care], \"QI\", Table1315[Duration])>= 4, 4,IF(SUMIF(Table1315[Type of Care], \"QI\", Table1315[Duration])<= 3, SUMIF(Table1315[Type of Care], \"QI\", Table1315[Duration]), 0))))> 90)","v":false}]
[null,null,"",null,null,null,null,{"$f":"IF( B22 > $D$10+14, SUMIFS($G$13:G22, $D$13:D22,\"Direct/Indirect/Clinical Administration\", $B$13:B22,\">\"&$D$10 + 14) + ((IF(SUMIF(Table1315[Type of Care], \"QI\", Table1315[Duration])>= 4, 4,IF(SUMIF(Table1315[Type of Care], \"QI\", Table1315[Duration])<= 3, SUMIF(Table1315[Type of Care], \"QI\", Table1315[Duration]), 0))))  > 90, SUMIFS($G$13:G22, $D$13:D22,\"Direct/Indirect/Clinical Administration\",  $B$13:B22,\"<=\"&$D$10 + 14)+ ((IF(SUMIF(Table1315[Type of Care], \"QI\", Table1315[Duration])>= 4, 4,IF(SUMIF(Table1315[Type of Care], \"QI\", Table1315[Duration])<= 3, SUMIF(Table1315[Type of Care], \"QI\", Table1315[Duration]), 0))))> 90)","v":false}]
[null,null,"",null,null,null,null,{"$f":"IF( B23 > $D$10+14, SUMIFS($G$13:G23, $D$13:D23,\"Direct/Indirect/Clinical Administration\", $B$13:B23,\">\"&$D$10 + 14) + ((IF(SUMIF(Table1315[Type of Care], \"QI\", Table1315[Duration])>= 4, 4,IF(SUMIF(Table1315[Type of Care], \"QI\", Table1315[Duration])<= 3, SUMIF(Table1315[Type of Care], \"QI\", Table1315[Duration]), 0))))  > 90, SUMIFS($G$13:G23, $D$13:D23,\"Direct/Indirect/Clinical Administration\",  $B$13:B23,\"<=\"&$D$10 + 14)+ ((IF(SUMIF(Table1315[Type of Care], \"QI\", Table1315[Duration])>= 4, 4,IF(SUMIF(Table1315[Type of Care], \"QI\", Table1315[Duration])<= 3, SUMIF(Table1315[Type of Care], \"QI\", Table1315[Duration]), 0))))> 90)","v":false}]
[null,null,"",null,null,null,null,{"$f":"IF( B24 > $D$10+14, SUMIFS($G$13:G24, $D$13:D24,\"Direct/Indirect/Clinical Administration\", $B$13:B24,\">\"&$D$10 + 14) + ((IF(SUMIF(Table1315[Type of Care], \"QI\", Table1315[Duration])>= 4, 4,IF(SUMIF(Table1315[Type of Care], \"QI\", Table1315[Duration])<= 3, SUMIF(Table1315[Type of Care], \"QI\", Table1315[Duration]), 0))))  > 90, SUMIFS($G$13:G24, $D$13:D24,\"Direct/Indirect/Clinical Administration\",  $B$13:B24,\"<=\"&$D$10 + 14)+ ((IF(SUMIF(Table1315[Type of Care], \"QI\", Table1315[Duration])>= 4, 4,IF(SUMIF(Table1315[Type of Care], \"QI\", Table1315[Duration])<= 3, SUMIF(Table1315[Type of Care], \"QI\", Table1315[Duration]), 0))))> 90)","v":false}]
[null,null,"",null,null,null,null,{"$f":"IF( B25 > $D$10+14, SUMIFS($G$13:G25, $D$13:D25,\"Direct/Indirect/Clinical Administration\", $B$13:B25,\">\"&$D$10 + 14) + ((IF(SUMIF(Table1315[Type of Care], \"QI\", Table1315[Duration])>= 4, 4,IF(SUMIF(Table1315[Type of Care], \"QI\", Table1315[Duration])<= 3, SUMIF(Table1315[Type of Care], \"QI\", Table1315[Duration]), 0))))  > 90, SUMIFS($G$13:G25, $D$13:D25,\"Direct/Indirect/Clinical Administration\",  $B$13:B25,\"<=\"&$D$10 + 14)+ ((IF(SUMIF(Table1315[Type of Care], \"QI\", Table1315[Duration])>= 4, 4,IF(SUMIF(Table1315[Type of Care], \"QI\", Table1315[Duration])<= 3, SUMIF(Table1315[Type of Care], \"QI\", Table1315[Duration]), 0))))> 90)","v":false}]
[null,null,"",null,null,null,null,{"$f":"IF( B26 > $D$10+14, SUMIFS($G$13:G26, $D$13:D26,\"Direct/Indirect/Clinical Administration\", $B$13:B26,\">\"&$D$10 + 14) + ((IF(SUMIF(Table1315[Type of Care], \"QI\", Table1315[Duration])>= 4, 4,IF(SUMIF(Table1315[Type of Care], \"QI\", Table1315[Duration])<= 3, SUMIF(Table1315[Type of Care], \"QI\", Table1315[Duration]), 0))))  > 90, SUMIFS($G$13:G26, $D$13:D26,\"Direct/Indirect/Clinical Administration\",  $B$13:B26,\"<=\"&$D$10 + 14)+ ((IF(SUMIF(Table1315[Type of Care], \"QI\", Table1315[Duration])>= 4, 4,IF(SUMIF(Table1315[Type of Care], \"QI\", Table1315[Duration])<= 3, SUMIF(Table1315[Type of Care], \"QI\", Table1315[Duration]), 0))))> 90)","v":false}]
[null,null,"",null,null,null,null,{"$f":"IF( B27 > $D$10+14, SUMIFS($G$13:G27, $D$13:D27,\"Direct/Indirect/Clinical Administration\", $B$13:B27,\">\"&$D$10 + 14) + ((IF(SUMIF(Table1315[Type of Care], \"QI\", Table1315[Duration])>= 4, 4,IF(SUMIF(Table1315[Type of Care], \"QI\", Table1315[Duration])<= 3, SUMIF(Table1315[Type of Care], \"QI\", Table1315[Duration]), 0))))  > 90, SUMIFS($G$13:G27, $D$13:D27,\"Direct/Indirect/Clinical Administration\",  $B$13:B27,\"<=\"&$D$10 + 14)+ ((IF(SUMIF(Table1315[Type of Care], \"QI\", Table1315[Duration])>= 4, 4,IF(SUMIF(Table1315[Type of Care], \"QI\", Table1315[Duration])<= 3, SUMIF(Table1315[Type of Care], \"QI\", Table1315[Duration]), 0))))> 90)","v":false}]
[null,null,"",null,null,null,null,{"$f":"IF( B28 > $D$10+14, SUMIFS($G$13:G28, $D$13:D28,\"Direct/Indirect/Clinical Administration\", $B$13:B28,\">\"&$D$10 + 14) + ((IF(SUMIF(Table1315[Type of Care], \"QI\", Table1315[Duration])>= 4, 4,IF(SUMIF(Table1315[Type of Care], \"QI\", Table1315[Duration])<= 3, SUMIF(Table1315[Type of Care], \"QI\", Table1315[Duration]), 0))))  > 90, SUMIFS($G$13:G28, $D$13:D28,\"Direct/Indirect/Clinical Administration\",  $B$13:B28,\"<=\"&$D$10 + 14)+ ((IF(SUMIF(Table1315[Type of Care], \"QI\", Table1315[Duration])>= 4, 4,IF(SUMIF(Table1315[Type of Care], \"QI\", Table1315[Duration])<= 3, SUMIF(Table1315[Type of Care], \"QI\", Table1315[Duration]), 0))))> 90)","v":false}]
[null,null,"",null,null,null,null,{"$f":"IF( B29 > $D$10+14, SUMIFS($G$13:G29, $D$13:D29,\"Direct/Indirect/Clinical Administration\", $B$13:B29,\">\"&$D$10 + 14) + ((IF(SUMIF(Table1315[Type of Care], \"QI\", Table1315[Duration])>= 4, 4,IF(SUMIF(Table1315[Type of Care], \"QI\", Table1315[Duration])<= 3, SUMIF(Table1315[Type of Care], \"QI\", Table1315[Duration]), 0))))  > 90, SUMIFS($G$13:G29, $D$13:D29,\"Direct/Indirect/Clinical Administration\",  $B$13:B29,\"<=\"&$D$10 + 14)+ ((IF(SUMIF(Table1315[Type of Care], \"QI\", Table1315[Duration])>= 4, 4,IF(SUMIF(Table1315[Type of Care], \"QI\", Table1315[Duration])<= 3, SUMIF(Table1315[Type of Care], \"QI\", Table1315[Duration]), 0))))> 90)","v":false}]
[null,null,{"$f":"IF(B30=\"\", \"\", B30)","v":""},null,null,null,null,{"$f":"IF( B30 > $D$10+14, SUMIFS($G$13:G30, $D$13:D30,\"Direct/Indirect/Clinical Administration\", $B$13:B30,\">\"&$D$10 + 14) + ((IF(SUMIF(Table1315[Type of Care], \"QI\", Table1315[Duration])>= 4, 4,IF(SUMIF(Table1315[Type of Care], \"QI\", Table1315[Duration])<= 3, SUMIF(Table1315[Type of Care], \"QI\", Table1315[Duration]), 0))))  > 90, SUMIFS($G$13:G30, $D$13:D30,\"Direct/Indirect/Clinical Administration\",  $B$13:B30,\"<=\"&$D$10 + 14)+ ((IF(SUMIF(Table1315[Type of Care], \"QI\", Table1315[Duration])>= 4, 4,IF(SUMIF(Table1315[Type of Care], \"QI\", Table1315[Duration])<= 3, SUMIF(Table1315[Type of Care], \"QI\", Table1315[Duration]), 0))))> 90)","v":false}]
[null,null,{"$f":"IF(B31=\"\", \"\", B31)","v":""},null,null,null,null,{"$f":"IF( B31 > $D$10+14, SUMIFS($G$13:G31, $D$13:D31,\"Direct/Indirect/Clinical Administration\", $B$13:B31,\">\"&$D$10 + 14) + ((IF(SUMIF(Table1315[Type of Care], \"QI\", Table1315[Duration])>= 4, 4,IF(SUMIF(Table1315[Type of Care], \"QI\", Table1315[Duration])<= 3, SUMIF(Table1315[Type of Care], \"QI\", Table1315[Duration]), 0))))  > 90, SUMIFS($G$13:G31, $D$13:D31,\"Direct/Indirect/Clinical Administration\",  $B$13:B31,\"<=\"&$D$10 + 14)+ ((IF(SUMIF(Table1315[Type of Care], \"QI\", Table1315[Duration])>= 4, 4,IF(SUMIF(Table1315[Type of Care], \"QI\", Table1315[Duration])<= 3, SUMIF(Table1315[Type of Care], \"QI\", Table1315[Duration]), 0))))> 90)","v":false}]
[null,null,"",null,null,null,null,{"$f":"IF( B32 > $D$10+14, SUMIFS($G$13:G32, $D$13:D32,\"Direct/Indirect/Clinical Administration\", $B$13:B32,\">\"&$D$10 + 14) + ((IF(SUMIF(Table1315[Type of Care], \"QI\", Table1315[Duration])>= 4, 4,IF(SUMIF(Table1315[Type of Care], \"QI\", Table1315[Duration])<= 3, SUMIF(Table1315[Type of Care], \"QI\", Table1315[Duration]), 0))))  > 90, SUMIFS($G$13:G32, $D$13:D32,\"Direct/Indirect/Clinical Administration\",  $B$13:B32,\"<=\"&$D$10 + 14)+ ((IF(SUMIF(Table1315[Type of Care], \"QI\", Table1315[Duration])>= 4, 4,IF(SUMIF(Table1315[Type of Care], \"QI\", Table1315[Duration])<= 3, SUMIF(Table1315[Type of Care], \"QI\", Table1315[Duration]), 0))))> 90)","v":false}]
[null,null,"",null,null,null,null,{"$f":"IF( B33 > $D$10+14, SUMIFS($G$13:G33, $D$13:D33,\"Direct/Indirect/Clinical Administration\", $B$13:B33,\">\"&$D$10 + 14) + ((IF(SUMIF(Table1315[Type of Care], \"QI\", Table1315[Duration])>= 4, 4,IF(SUMIF(Table1315[Type of Care], \"QI\", Table1315[Duration])<= 3, SUMIF(Table1315[Type of Care], \"QI\", Table1315[Duration]), 0))))  > 90, SUMIFS($G$13:G33, $D$13:D33,\"Direct/Indirect/Clinical Administration\",  $B$13:B33,\"<=\"&$D$10 + 14)+ ((IF(SUMIF(Table1315[Type of Care], \"QI\", Table1315[Duration])>= 4, 4,IF(SUMIF(Table1315[Type of Care], \"QI\", Table1315[Duration])<= 3, SUMIF(Table1315[Type of Care], \"QI\", Table1315[Duration]), 0))))> 90)","v":false}]
[null,null,"",null,null,null,null,{"$f":"IF( B34 > $D$10+14, SUMIFS($G$13:G34, $D$13:D34,\"Direct/Indirect/Clinical Administration\", $B$13:B34,\">\"&$D$10 + 14) + ((IF(SUMIF(Table1315[Type of Care], \"QI\", Table1315[Duration])>= 4, 4,IF(SUMIF(Table1315[Type of Care], \"QI\", Table1315[Duration])<= 3, SUMIF(Table1315[Type of Care], \"QI\", Table1315[Duration]), 0))))  > 90, SUMIFS($G$13:G34, $D$13:D34,\"Direct/Indirect/Clinical Administration\",  $B$13:B34,\"<=\"&$D$10 + 14)+ ((IF(SUMIF(Table1315[Type of Care], \"QI\", Table1315[Duration])>= 4, 4,IF(SUMIF(Table1315[Type of Care], \"QI\", Table1315[Duration])<= 3, SUMIF(Table1315[Type of Care], \"QI\", Table1315[Duration]), 0))))> 90)","v":false}]
[null,null,{"$f":"IF(B35=\"\", \"\", B35)","v":""},null,null,"Total Contract Hours",{"$f":"(SUMIF(Table1315[Type of Care], \"Direct/Indirect/Clinical Administration\",Table1315[Duration]))","v":0},"CT1"]
[null,null,null,null,null,"Total Included QI Hours",{"$f":"(IF(SUMIF(Table1315[Type of Care], \"QI\", Table1315[Duration])>= 4, 4,IF(SUMIF(Table1315[Type of Care], \"QI\", Table1315[Duration])<= 3, SUMIF(Table1315[Type of Care], \"QI\", Table1315[Duration]), 0)))","v":0},"QI1"]
[null,null,null,null,null,"Total Excluded Hours",{"$f":"G38+G39","v":0},"EX1"]
[null,null,null,null,null,"         Excluded Contract Hours",{"$f":"(SUMIF(Table1315[Type of Care], \"Third Party/Specialist FFS\",Table1315[Duration])) + (SUMIF(Table1315[Type of Care], \"Break (>15 Minutes)\", Table1315[Duration]))","v":0},"EXC1"]
[null,null,null,null,null,"      Excluded QI Hours",{"$f":"(SUMIF(Table1315[Type of Care], \"QI\", Table1315[Duration]) - (IF(SUMIF(Table1315[Type of Care], \"QI\", Table1315[Duration])>= 4, 4,IF(SUMIF(Table1315[Type of Care], \"QI\", Table1315[Duration])<= 3, SUMIF(Table1315[Type of Care], \"QI\", Table1315[Duration]), 0))))","v":0},"EXQI1"]
[null,null,{"$f":"IF(B40=\"\", \"\", B40)","v":""},null,null,"Hours Above 90hr/semi-monthly",{"$f":"  (IF(SUMIFS(Table1315[Duration],Table1315[Date (YYYY-MM-DD)], \">\"&$D$10+14, Table1315[Type of Care], \"Direct/Indirect/Clinical Administration\")>= 90, (SUMIFS(Table1315[Duration],Table1315[Date (YYYY-MM-DD)], \">\"&$D$10+14, Table1315[Type of Care], \"Direct/Indirect/Clinical Administration\")+ (IF(SUMIF(Table1315[Type of Care], \"QI\", Table1315[Duration])>= 4, 4,IF(SUMIF(Table1315[Type of Care], \"QI\", Table1315[Duration])<= 3, SUMIF(Table1315[Type of Care], \"QI\", Table1315[Duration]), 0))) -90))) + (IF(SUMIFS(Table1315[Duration],Table1315[Date (YYYY-MM-DD)], \"<=\"&$D$10+14, Table1315[Type of Care], \"Direct/Indirect/Clinical Administration\")>= 90, (SUMIFS(Table1315[Duration],Table1315[Date (YYYY-MM-DD)], \"<=\"&$D$10+14, Table1315[Type of Care], \"Direct/Indirect/Clinical Administration\")+ (IF(SUMIF(Table1315[Type of Care], \"QI\", Table1315[Duration])>= 4, 4,IF(SUMIF(Table1315[Type of Care], \"QI\", Table1315[Duration])<= 3, SUMIF(Table1315[Type of Care], \"QI\", Table1315[Duration]), 0))) -90)))","v":0},"A901"]
[]
[]
[null,{"$f":"IF(Clinic!C5=\"Jan - Mar\", \"February\", IF(Clinic!C5= \"Apr - June\", \"May\", IF(Clinic!C5=\"July - Sept\", \"August\", IF(Clinic!C5=\" Oct - Dec\", \"November\"))))","v":"February"},{"$f":"Clinic!C6","v":2021},{"$f":"DATE(YEAR(B46),MONTH(DATEVALUE(B43&\"1\")),1)","v":"1900-02-01"},null,null,null,"Month2"]
[]
[null,"Date (YYYY-MM-DD)","Day ","Type of Care","Start Time AM/PM","End Time AM/PM","Duration","FALSE/TRUE"]
[null,null,{"$f":"IF(B46=\"\", \"\", B46)","v":""},null,null,null,null,{"$f":"IF( B46 > $D$43+14, SUMIFS($G$46:G46, $D$46:D46,\"Direct/Indirect/Clinical Administration\", $B$46:B46,\">\"&$D$43 + 14) + ((IF(SUMIF(Table13216[Type of Care], \"QI\", Table13216[Duration])>= 4, 4,IF(SUMIF(Table13216[Type of Care], \"QI\", Table13216[Duration])<= 3, SUMIF(Table13216[Type of Care], \"QI\", Table13216[Duration]), 0))))  > 90, SUMIFS($G$46:G46, $D$46:D46,\"Direct/Indirect/Clinical Administration\",  $B$46:B46,\"<=\"&$D$43 + 14)+ ((IF(SUMIF(Table13216[Type of Care], \"QI\", Table13216[Duration])>= 4, 4,IF(SUMIF(Table13216[Type of Care], \"QI\", Table13216[Duration])<= 3, SUMIF(Table13216[Type of Care], \"QI\", Table13216[Duration]), 0))))> 90)","v":false}]
[null,null,{"$f":"IF(B47=\"\", \"\", B47)","v":""},null,null,null,null,{"$f":"IF( B47 > $D$43+14, SUMIFS($G$46:G47, $D$46:D47,\"Direct/Indirect/Clinical Administration\", $B$46:B47,\">\"&$D$43 + 14) + ((IF(SUMIF(Table13216[Type of Care], \"QI\", Table13216[Duration])>= 4, 4,IF(SUMIF(Table13216[Type of Care], \"QI\", Table13216[Duration])<= 3, SUMIF(Table13216[Type of Care], \"QI\", Table13216[Duration]), 0))))  > 90, SUMIFS($G$46:G47, $D$46:D47,\"Direct/Indirect/Clinical Administration\",  $B$46:B47,\"<=\"&$D$43 + 14)+ ((IF(SUMIF(Table13216[Type of Care], \"QI\", Table13216[Duration])>= 4, 4,IF(SUMIF(Table13216[Type of Care], \"QI\", Table13216[Duration])<= 3, SUMIF(Table13216[Type of Care], \"QI\", Table13216[Duration]), 0))))> 90)","v":false}]
[null,null,"",null,null,null,null,{"$f":"IF( B48 > $D$43+14, SUMIFS($G$46:G48, $D$46:D48,\"Direct/Indirect/Clinical Administration\", $B$46:B48,\">\"&$D$43 + 14) + ((IF(SUMIF(Table13216[Type of Care], \"QI\", Table13216[Duration])>= 4, 4,IF(SUMIF(Table13216[Type of Care], \"QI\", Table13216[Duration])<= 3, SUMIF(Table13216[Type of Care], \"QI\", Table13216[Duration]), 0))))  > 90, SUMIFS($G$46:G48, $D$46:D48,\"Direct/Indirect/Clinical Administration\",  $B$46:B48,\"<=\"&$D$43 + 14)+ ((IF(SUMIF(Table13216[Type of Care], \"QI\", Table13216[Duration])>= 4, 4,IF(SUMIF(Table13216[Type of Care], \"QI\", Table13216[Duration])<= 3, SUMIF(Table13216[Type of Care], \"QI\", Table13216[Duration]), 0))))> 90)","v":false}]
[null,null,"",null,null,null,null,{"$f":"IF( B49 > $D$43+14, SUMIFS($G$46:G49, $D$46:D49,\"Direct/Indirect/Clinical Administration\", $B$46:B49,\">\"&$D$43 + 14) + ((IF(SUMIF(Table13216[Type of Care], \"QI\", Table13216[Duration])>= 4, 4,IF(SUMIF(Table13216[Type of Care], \"QI\", Table13216[Duration])<= 3, SUMIF(Table13216[Type of Care], \"QI\", Table13216[Duration]), 0))))  > 90, SUMIFS($G$46:G49, $D$46:D49,\"Direct/Indirect/Clinical Administration\",  $B$46:B49,\"<=\"&$D$43 + 14)+ ((IF(SUMIF(Table13216[Type of Care], \"QI\", Table13216[Duration])>= 4, 4,IF(SUMIF(Table13216[Type of Care], \"QI\", Table13216[Duration])<= 3, SUMIF(Table13216[Type of Care], \"QI\", Table13216[Duration]), 0))))> 90)","v":false}]
[null,null,"",null,null,null,null,{"$f":"IF( B50 > $D$43+14, SUMIFS($G$46:G50, $D$46:D50,\"Direct/Indirect/Clinical Administration\", $B$46:B50,\">\"&$D$43 + 14) + ((IF(SUMIF(Table13216[Type of Care], \"QI\", Table13216[Duration])>= 4, 4,IF(SUMIF(Table13216[Type of Care], \"QI\", Table13216[Duration])<= 3, SUMIF(Table13216[Type of Care], \"QI\", Table13216[Duration]), 0))))  > 90, SUMIFS($G$46:G50, $D$46:D50,\"Direct/Indirect/Clinical Administration\",  $B$46:B50,\"<=\"&$D$43 + 14)+ ((IF(SUMIF(Table13216[Type of Care], \"QI\", Table13216[Duration])>= 4, 4,IF(SUMIF(Table13216[Type of Care], \"QI\", Table13216[Duration])<= 3, SUMIF(Table13216[Type of Care], \"QI\", Table13216[Duration]), 0))))> 90)","v":false}]
[null,null,"",null,null,null,null,{"$f":"IF( B51 > $D$43+14, SUMIFS($G$46:G51, $D$46:D51,\"Direct/Indirect/Clinical Administration\", $B$46:B51,\">\"&$D$43 + 14) + ((IF(SUMIF(Table13216[Type of Care], \"QI\", Table13216[Duration])>= 4, 4,IF(SUMIF(Table13216[Type of Care], \"QI\", Table13216[Duration])<= 3, SUMIF(Table13216[Type of Care], \"QI\", Table13216[Duration]), 0))))  > 90, SUMIFS($G$46:G51, $D$46:D51,\"Direct/Indirect/Clinical Administration\",  $B$46:B51,\"<=\"&$D$43 + 14)+ ((IF(SUMIF(Table13216[Type of Care], \"QI\", Table13216[Duration])>= 4, 4,IF(SUMIF(Table13216[Type of Care], \"QI\", Table13216[Duration])<= 3, SUMIF(Table13216[Type of Care], \"QI\", Table13216[Duration]), 0))))> 90)","v":false}]
[null,null,"",null,null,null,null,{"$f":"IF( B52 > $D$43+14, SUMIFS($G$46:G52, $D$46:D52,\"Direct/Indirect/Clinical Administration\", $B$46:B52,\">\"&$D$43 + 14) + ((IF(SUMIF(Table13216[Type of Care], \"QI\", Table13216[Duration])>= 4, 4,IF(SUMIF(Table13216[Type of Care], \"QI\", Table13216[Duration])<= 3, SUMIF(Table13216[Type of Care], \"QI\", Table13216[Duration]), 0))))  > 90, SUMIFS($G$46:G52, $D$46:D52,\"Direct/Indirect/Clinical Administration\",  $B$46:B52,\"<=\"&$D$43 + 14)+ ((IF(SUMIF(Table13216[Type of Care], \"QI\", Table13216[Duration])>= 4, 4,IF(SUMIF(Table13216[Type of Care], \"QI\", Table13216[Duration])<= 3, SUMIF(Table13216[Type of Care], \"QI\", Table13216[Duration]), 0))))> 90)","v":false}]
[null,null,"",null,null,null,null,{"$f":"IF( B53 > $D$43+14, SUMIFS($G$46:G53, $D$46:D53,\"Direct/Indirect/Clinical Administration\", $B$46:B53,\">\"&$D$43 + 14) + ((IF(SUMIF(Table13216[Type of Care], \"QI\", Table13216[Duration])>= 4, 4,IF(SUMIF(Table13216[Type of Care], \"QI\", Table13216[Duration])<= 3, SUMIF(Table13216[Type of Care], \"QI\", Table13216[Duration]), 0))))  > 90, SUMIFS($G$46:G53, $D$46:D53,\"Direct/Indirect/Clinical Administration\",  $B$46:B53,\"<=\"&$D$43 + 14)+ ((IF(SUMIF(Table13216[Type of Care], \"QI\", Table13216[Duration])>= 4, 4,IF(SUMIF(Table13216[Type of Care], \"QI\", Table13216[Duration])<= 3, SUMIF(Table13216[Type of Care], \"QI\", Table13216[Duration]), 0))))> 90)","v":false}]
[null,null,"",null,null,null,null,{"$f":"IF( B54 > $D$43+14, SUMIFS($G$46:G54, $D$46:D54,\"Direct/Indirect/Clinical Administration\", $B$46:B54,\">\"&$D$43 + 14) + ((IF(SUMIF(Table13216[Type of Care], \"QI\", Table13216[Duration])>= 4, 4,IF(SUMIF(Table13216[Type of Care], \"QI\", Table13216[Duration])<= 3, SUMIF(Table13216[Type of Care], \"QI\", Table13216[Duration]), 0))))  > 90, SUMIFS($G$46:G54, $D$46:D54,\"Direct/Indirect/Clinical Administration\",  $B$46:B54,\"<=\"&$D$43 + 14)+ ((IF(SUMIF(Table13216[Type of Care], \"QI\", Table13216[Duration])>= 4, 4,IF(SUMIF(Table13216[Type of Care], \"QI\", Table13216[Duration])<= 3, SUMIF(Table13216[Type of Care], \"QI\", Table13216[Duration]), 0))))> 90)","v":false}]
[null,null,"",null,null,null,null,{"$f":"IF( B55 > $D$43+14, SUMIFS($G$46:G55, $D$46:D55,\"Direct/Indirect/Clinical Administration\", $B$46:B55,\">\"&$D$43 + 14) + ((IF(SUMIF(Table13216[Type of Care], \"QI\", Table13216[Duration])>= 4, 4,IF(SUMIF(Table13216[Type of Care], \"QI\", Table13216[Duration])<= 3, SUMIF(Table13216[Type of Care], \"QI\", Table13216[Duration]), 0))))  > 90, SUMIFS($G$46:G55, $D$46:D55,\"Direct/Indirect/Clinical Administration\",  $B$46:B55,\"<=\"&$D$43 + 14)+ ((IF(SUMIF(Table13216[Type of Care], \"QI\", Table13216[Duration])>= 4, 4,IF(SUMIF(Table13216[Type of Care], \"QI\", Table13216[Duration])<= 3, SUMIF(Table13216[Type of Care], \"QI\", Table13216[Duration]), 0))))> 90)","v":false}]
[null,null,"",null,null,null,null,{"$f":"IF( B56 > $D$43+14, SUMIFS($G$46:G56, $D$46:D56,\"Direct/Indirect/Clinical Administration\", $B$46:B56,\">\"&$D$43 + 14) + ((IF(SUMIF(Table13216[Type of Care], \"QI\", Table13216[Duration])>= 4, 4,IF(SUMIF(Table13216[Type of Care], \"QI\", Table13216[Duration])<= 3, SUMIF(Table13216[Type of Care], \"QI\", Table13216[Duration]), 0))))  > 90, SUMIFS($G$46:G56, $D$46:D56,\"Direct/Indirect/Clinical Administration\",  $B$46:B56,\"<=\"&$D$43 + 14)+ ((IF(SUMIF(Table13216[Type of Care], \"QI\", Table13216[Duration])>= 4, 4,IF(SUMIF(Table13216[Type of Care], \"QI\", Table13216[Duration])<= 3, SUMIF(Table13216[Type of Care], \"QI\", Table13216[Duration]), 0))))> 90)","v":false}]
[null,null,{"$f":"IF(B57=\"\", \"\", B57)","v":""},null,null,null,null,{"$f":"IF( B57 > $D$43+14, SUMIFS($G$46:G57, $D$46:D57,\"Direct/Indirect/Clinical Administration\", $B$46:B57,\">\"&$D$43 + 14) + ((IF(SUMIF(Table13216[Type of Care], \"QI\", Table13216[Duration])>= 4, 4,IF(SUMIF(Table13216[Type of Care], \"QI\", Table13216[Duration])<= 3, SUMIF(Table13216[Type of Care], \"QI\", Table13216[Duration]), 0))))  > 90, SUMIFS($G$46:G57, $D$46:D57,\"Direct/Indirect/Clinical Administration\",  $B$46:B57,\"<=\"&$D$43 + 14)+ ((IF(SUMIF(Table13216[Type of Care], \"QI\", Table13216[Duration])>= 4, 4,IF(SUMIF(Table13216[Type of Care], \"QI\", Table13216[Duration])<= 3, SUMIF(Table13216[Type of Care], \"QI\", Table13216[Duration]), 0))))> 90)","v":false}]
[null,null,"",null,null,null,null,{"$f":"IF( B58 > $D$43+14, SUMIFS($G$46:G58, $D$46:D58,\"Direct/Indirect/Clinical Administration\", $B$46:B58,\">\"&$D$43 + 14) + ((IF(SUMIF(Table13216[Type of Care], \"QI\", Table13216[Duration])>= 4, 4,IF(SUMIF(Table13216[Type of Care], \"QI\", Table13216[Duration])<= 3, SUMIF(Table13216[Type of Care], \"QI\", Table13216[Duration]), 0))))  > 90, SUMIFS($G$46:G58, $D$46:D58,\"Direct/Indirect/Clinical Administration\",  $B$46:B58,\"<=\"&$D$43 + 14)+ ((IF(SUMIF(Table13216[Type of Care], \"QI\", Table13216[Duration])>= 4, 4,IF(SUMIF(Table13216[Type of Care], \"QI\", Table13216[Duration])<= 3, SUMIF(Table13216[Type of Care], \"QI\", Table13216[Duration]), 0))))> 90)","v":false}]
[null,null,"",null,null,null,null,{"$f":"IF( B59 > $D$43+14, SUMIFS($G$46:G59, $D$46:D59,\"Direct/Indirect/Clinical Administration\", $B$46:B59,\">\"&$D$43 + 14) + ((IF(SUMIF(Table13216[Type of Care], \"QI\", Table13216[Duration])>= 4, 4,IF(SUMIF(Table13216[Type of Care], \"QI\", Table13216[Duration])<= 3, SUMIF(Table13216[Type of Care], \"QI\", Table13216[Duration]), 0))))  > 90, SUMIFS($G$46:G59, $D$46:D59,\"Direct/Indirect/Clinical Administration\",  $B$46:B59,\"<=\"&$D$43 + 14)+ ((IF(SUMIF(Table13216[Type of Care], \"QI\", Table13216[Duration])>= 4, 4,IF(SUMIF(Table13216[Type of Care], \"QI\", Table13216[Duration])<= 3, SUMIF(Table13216[Type of Care], \"QI\", Table13216[Duration]), 0))))> 90)","v":false}]
[null,null,"",null,null,null,null,{"$f":"IF( B60 > $D$43+14, SUMIFS($G$46:G60, $D$46:D60,\"Direct/Indirect/Clinical Administration\", $B$46:B60,\">\"&$D$43 + 14) + ((IF(SUMIF(Table13216[Type of Care], \"QI\", Table13216[Duration])>= 4, 4,IF(SUMIF(Table13216[Type of Care], \"QI\", Table13216[Duration])<= 3, SUMIF(Table13216[Type of Care], \"QI\", Table13216[Duration]), 0))))  > 90, SUMIFS($G$46:G60, $D$46:D60,\"Direct/Indirect/Clinical Administration\",  $B$46:B60,\"<=\"&$D$43 + 14)+ ((IF(SUMIF(Table13216[Type of Care], \"QI\", Table13216[Duration])>= 4, 4,IF(SUMIF(Table13216[Type of Care], \"QI\", Table13216[Duration])<= 3, SUMIF(Table13216[Type of Care], \"QI\", Table13216[Duration]), 0))))> 90)","v":false}]
[null,null,"",null,null,null,null,{"$f":"IF( B61 > $D$43+14, SUMIFS($G$46:G61, $D$46:D61,\"Direct/Indirect/Clinical Administration\", $B$46:B61,\">\"&$D$43 + 14) + ((IF(SUMIF(Table13216[Type of Care], \"QI\", Table13216[Duration])>= 4, 4,IF(SUMIF(Table13216[Type of Care], \"QI\", Table13216[Duration])<= 3, SUMIF(Table13216[Type of Care], \"QI\", Table13216[Duration]), 0))))  > 90, SUMIFS($G$46:G61, $D$46:D61,\"Direct/Indirect/Clinical Administration\",  $B$46:B61,\"<=\"&$D$43 + 14)+ ((IF(SUMIF(Table13216[Type of Care], \"QI\", Table13216[Duration])>= 4, 4,IF(SUMIF(Table13216[Type of Care], \"QI\", Table13216[Duration])<= 3, SUMIF(Table13216[Type of Care], \"QI\", Table13216[Duration]), 0))))> 90)","v":false}]
[null,null,"",null,null,null,null,{"$f":"IF( B62 > $D$43+14, SUMIFS($G$46:G62, $D$46:D62,\"Direct/Indirect/Clinical Administration\", $B$46:B62,\">\"&$D$43 + 14) + ((IF(SUMIF(Table13216[Type of Care], \"QI\", Table13216[Duration])>= 4, 4,IF(SUMIF(Table13216[Type of Care], \"QI\", Table13216[Duration])<= 3, SUMIF(Table13216[Type of Care], \"QI\", Table13216[Duration]), 0))))  > 90, SUMIFS($G$46:G62, $D$46:D62,\"Direct/Indirect/Clinical Administration\",  $B$46:B62,\"<=\"&$D$43 + 14)+ ((IF(SUMIF(Table13216[Type of Care], \"QI\", Table13216[Duration])>= 4, 4,IF(SUMIF(Table13216[Type of Care], \"QI\", Table13216[Duration])<= 3, SUMIF(Table13216[Type of Care], \"QI\", Table13216[Duration]), 0))))> 90)","v":false}]
[null,null,{"$f":"IF(B63=\"\", \"\", B63)","v":""},null,null,null,null,{"$f":"IF( B63 > $D$43+14, SUMIFS($G$46:G63, $D$46:D63,\"Direct/Indirect/Clinical Administration\", $B$46:B63,\">\"&$D$43 + 14) + ((IF(SUMIF(Table13216[Type of Care], \"QI\", Table13216[Duration])>= 4, 4,IF(SUMIF(Table13216[Type of Care], \"QI\", Table13216[Duration])<= 3, SUMIF(Table13216[Type of Care], \"QI\", Table13216[Duration]), 0))))  > 90, SUMIFS($G$46:G63, $D$46:D63,\"Direct/Indirect/Clinical Administration\",  $B$46:B63,\"<=\"&$D$43 + 14)+ ((IF(SUMIF(Table13216[Type of Care], \"QI\", Table13216[Duration])>= 4, 4,IF(SUMIF(Table13216[Type of Care], \"QI\", Table13216[Duration])<= 3, SUMIF(Table13216[Type of Care], \"QI\", Table13216[Duration]), 0))))> 90)","v":false}]
[null,null,"",null,null,null,null,{"$f":"IF( B64 > $D$43+14, SUMIFS($G$46:G64, $D$46:D64,\"Direct/Indirect/Clinical Administration\", $B$46:B64,\">\"&$D$43 + 14) + ((IF(SUMIF(Table13216[Type of Care], \"QI\", Table13216[Duration])>= 4, 4,IF(SUMIF(Table13216[Type of Care], \"QI\", Table13216[Duration])<= 3, SUMIF(Table13216[Type of Care], \"QI\", Table13216[Duration]), 0))))  > 90, SUMIFS($G$46:G64, $D$46:D64,\"Direct/Indirect/Clinical Administration\",  $B$46:B64,\"<=\"&$D$43 + 14)+ ((IF(SUMIF(Table13216[Type of Care], \"QI\", Table13216[Duration])>= 4, 4,IF(SUMIF(Table13216[Type of Care], \"QI\", Table13216[Duration])<= 3, SUMIF(Table13216[Type of Care], \"QI\", Table13216[Duration]), 0))))> 90)","v":false}]
[null,null,"",null,null,null,null,{"$f":"IF( B65 > $D$43+14, SUMIFS($G$46:G65, $D$46:D65,\"Direct/Indirect/Clinical Administration\", $B$46:B65,\">\"&$D$43 + 14) + ((IF(SUMIF(Table13216[Type of Care], \"QI\", Table13216[Duration])>= 4, 4,IF(SUMIF(Table13216[Type of Care], \"QI\", Table13216[Duration])<= 3, SUMIF(Table13216[Type of Care], \"QI\", Table13216[Duration]), 0))))  > 90, SUMIFS($G$46:G65, $D$46:D65,\"Direct/Indirect/Clinical Administration\",  $B$46:B65,\"<=\"&$D$43 + 14)+ ((IF(SUMIF(Table13216[Type of Care], \"QI\", Table13216[Duration])>= 4, 4,IF(SUMIF(Table13216[Type of Care], \"QI\", Table13216[Duration])<= 3, SUMIF(Table13216[Type of Care], \"QI\", Table13216[Duration]), 0))))> 90)","v":false}]
[null,null,"",null,null,null,null,{"$f":"IF( B66 > $D$43+14, SUMIFS($G$46:G66, $D$46:D66,\"Direct/Indirect/Clinical Administration\", $B$46:B66,\">\"&$D$43 + 14) + ((IF(SUMIF(Table13216[Type of Care], \"QI\", Table13216[Duration])>= 4, 4,IF(SUMIF(Table13216[Type of Care], \"QI\", Table13216[Duration])<= 3, SUMIF(Table13216[Type of Care], \"QI\", Table13216[Duration]), 0))))  > 90, SUMIFS($G$46:G66, $D$46:D66,\"Direct/Indirect/Clinical Administration\",  $B$46:B66,\"<=\"&$D$43 + 14)+ ((IF(SUMIF(Table13216[Type of Care], \"QI\", Table13216[Duration])>= 4, 4,IF(SUMIF(Table13216[Type of Care], \"QI\", Table13216[Duration])<= 3, SUMIF(Table13216[Type of Care], \"QI\", Table13216[Duration]), 0))))> 90)","v":false}]
[null,null,"",null,null,null,null,{"$f":"IF( B67 > $D$43+14, SUMIFS($G$46:G67, $D$46:D67,\"Direct/Indirect/Clinical Administration\", $B$46:B67,\">\"&$D$43 + 14) + ((IF(SUMIF(Table13216[Type of Care], \"QI\", Table13216[Duration])>= 4, 4,IF(SUMIF(Table13216[Type of Care], \"QI\", Table13216[Duration])<= 3, SUMIF(Table13216[Type of Care], \"QI\", Table13216[Duration]), 0))))  > 90, SUMIFS($G$46:G67, $D$46:D67,\"Direct/Indirect/Clinical Administration\",  $B$46:B67,\"<=\"&$D$43 + 14)+ ((IF(SUMIF(Table13216[Type of Care], \"QI\", Table13216[Duration])>= 4, 4,IF(SUMIF(Table13216[Type of Care], \"QI\", Table13216[Duration])<= 3, SUMIF(Table13216[Type of Care], \"QI\", Table13216[Duration]), 0))))> 90)","v":false}]
[null,null,"",null,null,null,null,{"$f":"IF( B68 > $D$43+14, SUMIFS($G$46:G68, $D$46:D68,\"Direct/Indirect/Clinical Administration\", $B$46:B68,\">\"&$D$43 + 14) + ((IF(SUMIF(Table13216[Type of Care], \"QI\", Table13216[Duration])>= 4, 4,IF(SUMIF(Table13216[Type of Care], \"QI\", Table13216[Duration])<= 3, SUMIF(Table13216[Type of Care], \"QI\", Table13216[Duration]), 0))))  > 90, SUMIFS($G$46:G68, $D$46:D68,\"Direct/Indirect/Clinical Administration\",  $B$46:B68,\"<=\"&$D$43 + 14)+ ((IF(SUMIF(Table13216[Type of Care], \"QI\", Table13216[Duration])>= 4, 4,IF(SUMIF(Table13216[Type of Care], \"QI\", Table13216[Duration])<= 3, SUMIF(Table13216[Type of Care], \"QI\", Table13216[Duration]), 0))))> 90)","v":false}]
[null,null,{"$f":"IF(B69=\"\", \"\", B69)","v":""},null,null,null,null,{"$f":"IF( B69 > $D$43+14, SUMIFS($G$46:G69, $D$46:D69,\"Direct/Indirect/Clinical Administration\", $B$46:B69,\">\"&$D$43 + 14) + ((IF(SUMIF(Table13216[Type of Care], \"QI\", Table13216[Duration])>= 4, 4,IF(SUMIF(Table13216[Type of Care], \"QI\", Table13216[Duration])<= 3, SUMIF(Table13216[Type of Care], \"QI\", Table13216[Duration]), 0))))  > 90, SUMIFS($G$46:G69, $D$46:D69,\"Direct/Indirect/Clinical Administration\",  $B$46:B69,\"<=\"&$D$43 + 14)+ ((IF(SUMIF(Table13216[Type of Care], \"QI\", Table13216[Duration])>= 4, 4,IF(SUMIF(Table13216[Type of Care], \"QI\", Table13216[Duration])<= 3, SUMIF(Table13216[Type of Care], \"QI\", Table13216[Duration]), 0))))> 90)","v":false}]
[null,null,"",null,null,null,null,{"$f":"IF( B70 > $D$43+14, SUMIFS($G$46:G70, $D$46:D70,\"Direct/Indirect/Clinical Administration\", $B$46:B70,\">\"&$D$43 + 14) + ((IF(SUMIF(Table13216[Type of Care], \"QI\", Table13216[Duration])>= 4, 4,IF(SUMIF(Table13216[Type of Care], \"QI\", Table13216[Duration])<= 3, SUMIF(Table13216[Type of Care], \"QI\", Table13216[Duration]), 0))))  > 90, SUMIFS($G$46:G70, $D$46:D70,\"Direct/Indirect/Clinical Administration\",  $B$46:B70,\"<=\"&$D$43 + 14)+ ((IF(SUMIF(Table13216[Type of Care], \"QI\", Table13216[Duration])>= 4, 4,IF(SUMIF(Table13216[Type of Care], \"QI\", Table13216[Duration])<= 3, SUMIF(Table13216[Type of Care], \"QI\", Table13216[Duration]), 0))))> 90)","v":false}]
[null,null,"",null,null,null,null,{"$f":"IF( B71 > $D$43+14, SUMIFS($G$46:G71, $D$46:D71,\"Direct/Indirect/Clinical Administration\", $B$46:B71,\">\"&$D$43 + 14) + ((IF(SUMIF(Table13216[Type of Care], \"QI\", Table13216[Duration])>= 4, 4,IF(SUMIF(Table13216[Type of Care], \"QI\", Table13216[Duration])<= 3, SUMIF(Table13216[Type of Care], \"QI\", Table13216[Duration]), 0))))  > 90, SUMIFS($G$46:G71, $D$46:D71,\"Direct/Indirect/Clinical Administration\",  $B$46:B71,\"<=\"&$D$43 + 14)+ ((IF(SUMIF(Table13216[Type of Care], \"QI\", Table13216[Duration])>= 4, 4,IF(SUMIF(Table13216[Type of Care], \"QI\", Table13216[Duration])<= 3, SUMIF(Table13216[Type of Care], \"QI\", Table13216[Duration]), 0))))> 90)","v":false}]
[null,null,"",null,null,null,null,{"$f":"IF( B72 > $D$43+14, SUMIFS($G$46:G72, $D$46:D72,\"Direct/Indirect/Clinical Administration\", $B$46:B72,\">\"&$D$43 + 14) + ((IF(SUMIF(Table13216[Type of Care], \"QI\", Table13216[Duration])>= 4, 4,IF(SUMIF(Table13216[Type of Care], \"QI\", Table13216[Duration])<= 3, SUMIF(Table13216[Type of Care], \"QI\", Table13216[Duration]), 0))))  > 90, SUMIFS($G$46:G72, $D$46:D72,\"Direct/Indirect/Clinical Administration\",  $B$46:B72,\"<=\"&$D$43 + 14)+ ((IF(SUMIF(Table13216[Type of Care], \"QI\", Table13216[Duration])>= 4, 4,IF(SUMIF(Table13216[Type of Care], \"QI\", Table13216[Duration])<= 3, SUMIF(Table13216[Type of Care], \"QI\", Table13216[Duration]), 0))))> 90)","v":false}]
[null,null,"",null,null,null,null,{"$f":"IF( B73 > $D$43+14, SUMIFS($G$46:G73, $D$46:D73,\"Direct/Indirect/Clinical Administration\", $B$46:B73,\">\"&$D$43 + 14) + ((IF(SUMIF(Table13216[Type of Care], \"QI\", Table13216[Duration])>= 4, 4,IF(SUMIF(Table13216[Type of Care], \"QI\", Table13216[Duration])<= 3, SUMIF(Table13216[Type of Care], \"QI\", Table13216[Duration]), 0))))  > 90, SUMIFS($G$46:G73, $D$46:D73,\"Direct/Indirect/Clinical Administration\",  $B$46:B73,\"<=\"&$D$43 + 14)+ ((IF(SUMIF(Table13216[Type of Care], \"QI\", Table13216[Duration])>= 4, 4,IF(SUMIF(Table13216[Type of Care], \"QI\", Table13216[Duration])<= 3, SUMIF(Table13216[Type of Care], \"QI\", Table13216[Duration]), 0))))> 90)","v":false}]
[null,null,"",null,null,null,null,{"$f":"IF( B74 > $D$43+14, SUMIFS($G$46:G74, $D$46:D74,\"Direct/Indirect/Clinical Administration\", $B$46:B74,\">\"&$D$43 + 14) + ((IF(SUMIF(Table13216[Type of Care], \"QI\", Table13216[Duration])>= 4, 4,IF(SUMIF(Table13216[Type of Care], \"QI\", Table13216[Duration])<= 3, SUMIF(Table13216[Type of Care], \"QI\", Table13216[Duration]), 0))))  > 90, SUMIFS($G$46:G74, $D$46:D74,\"Direct/Indirect/Clinical Administration\",  $B$46:B74,\"<=\"&$D$43 + 14)+ ((IF(SUMIF(Table13216[Type of Care], \"QI\", Table13216[Duration])>= 4, 4,IF(SUMIF(Table13216[Type of Care], \"QI\", Table13216[Duration])<= 3, SUMIF(Table13216[Type of Care], \"QI\", Table13216[Duration]), 0))))> 90)","v":false}]
[null,null,{"$f":"IF(B75=\"\", \"\", B75)","v":""},null,null,"Total Contract Hours",{"$f":"(SUMIF(Table13216[Type of Care], \"Direct/Indirect/Clinical Administration\",Table13216[Duration])) + (SUMIF(Table13216[Type of Care], \"Correction Hours\",Table13216[Duration]))","v":0},"CT2"]
[null,null,null,null,null,"Total Included QI Hours",{"$f":"(IF(SUMIF(Table13216[Type of Care], \"QI\", Table13216[Duration])>= 4, 4,IF(SUMIF(Table13216[Type of Care], \"QI\", Table13216[Duration])<= 3, SUMIF(Table13216[Type of Care], \"QI\", Table13216[Duration]), 0)))","v":0},"QI2"]
[null,null,null,null,null,"Total Excluded Hours",{"$f":"G78+G79","v":0},"EX2"]
[null,null,null,null,null,"         Excluded Contract Hours",{"$f":"(SUMIF(Table13216[Type of Care], \"Third Party/Specialist FFS\",Table13216[Duration])) + (SUMIF(Table13216[Type of Care], \"Break (>15 Minutes)\", Table13216[Duration]))","v":0},"EXC2"]
[null,null,null,null,null,"      Excluded QI Hours",{"$f":"(SUMIF(Table13216[Type of Care], \"QI\", Table13216[Duration]) - (IF(SUMIF(Table13216[Type of Care], \"QI\", Table13216[Duration])>= 4, 4,IF(SUMIF(Table13216[Type of Care], \"QI\", Table13216[Duration])<= 3, SUMIF(Table13216[Type of Care], \"QI\", Table13216[Duration]), 0))))","v":0},"EXQI2"]
[null,null,{"$f":"IF(B80=\"\", \"\", B80)","v":""},null,null,"Hours Above 90hr/semi-monthly",{"$f":"  (IF(SUMIFS(Table13216[Duration],Table13216[Date (YYYY-MM-DD)], \">\"&$D$43+14, Table13216[Type of Care], \"Direct/Indirect/Clinical Administration\")>= 90, (SUMIFS(Table13216[Duration],Table13216[Date (YYYY-MM-DD)], \">\"&$D$43+14, Table13216[Type of Care], \"Direct/Indirect/Clinical Administration\")+ (IF(SUMIF(Table13216[Type of Care], \"QI\", Table13216[Duration])>= 4, 4,IF(SUMIF(Table13216[Type of Care], \"QI\", Table13216[Duration])<= 3, SUMIF(Table13216[Type of Care], \"QI\", Table13216[Duration]), 0))) -90))) + (IF(SUMIFS(Table13216[Duration],Table13216[Date (YYYY-MM-DD)], \"<=\"&$D$43+14, Table13216[Type of Care], \"Direct/Indirect/Clinical Administration\")>= 90, (SUMIFS(Table13216[Duration],Table13216[Date (YYYY-MM-DD)], \"<=\"&$D$43+14, Table13216[Type of Care], \"Direct/Indirect/Clinical Administration\")+ (IF(SUMIF(Table13216[Type of Care], \"QI\", Table13216[Duration])>= 4, 4,IF(SUMIF(Table13216[Type of Care], \"QI\", Table13216[Duration])<= 3, SUMIF(Table13216[Type of Care], \"QI\", Table13216[Duration]), 0))) -90)))","v":0},"A902"]
[]
[]
[null,{"$f":"IF(Clinic!C5=\"Jan - Mar\", \"March\", IF(Clinic!C5= \"Apr - June\", \"June\", IF(Clinic!C5=\"July - Sept\", \"September\", IF(Clinic!C5=\" Oct - Dec\", \"December\"))))","v":"March"},{"$f":"Clinic!C6","v":2021},{"$f":"DATE(YEAR(B86),MONTH(DATEVALUE(B83&\"1\")),1)","v":"1900-03-01"},null,null,null,"Month3"]
[]
[null,"Date (YYYY-MM-DD)","Day ","Type of Care","Start Time AM/PM","End Time AM/PM","Duration ","FALSE/TRUE"]
[null,null,{"$f":"IF(B86=\"\", \"\", B86)","v":""},null,null,null,null,{"$f":"IF( B86 > $D$83+14, SUMIFS($G$86:G86, $D$86:D86,\"Direct/Indirect/Clinical Administration\", $B$86:B86,\">\"&$D$83 + 14) + ((IF(SUMIF(Table132617[Type of Care], \"QI\", Table132617[[Duration ]])>= 4, 4,IF(SUMIF(Table132617[Type of Care], \"QI\", Table132617[[Duration ]])<= 3, SUMIF(Table132617[Type of Care], \"QI\", Table132617[[Duration ]]), 0))))  > 90, SUMIFS($G$86:G86, $D$86:D86,\"Direct/Indirect/Clinical Administration\",  $B$86:B86,\"<=\"&$D$83 + 14)+ ((IF(SUMIF(Table132617[Type of Care], \"QI\", Table132617[[Duration ]])>= 4, 4,IF(SUMIF(Table132617[Type of Care], \"QI\", Table132617[[Duration ]])<= 3, SUMIF(Table132617[Type of Care], \"QI\", Table132617[[Duration ]]), 0))))> 90)","v":false}]
[null,null,{"$f":"IF(B87=\"\", \"\", B87)","v":""},null,null,null,null,{"$f":"IF( B87 > $D$83+14, SUMIFS($G$86:G87, $D$86:D87,\"Direct/Indirect/Clinical Administration\", $B$86:B87,\">\"&$D$83 + 14) + ((IF(SUMIF(Table132617[Type of Care], \"QI\", Table132617[[Duration ]])>= 4, 4,IF(SUMIF(Table132617[Type of Care], \"QI\", Table132617[[Duration ]])<= 3, SUMIF(Table132617[Type of Care], \"QI\", Table132617[[Duration ]]), 0))))  > 90, SUMIFS($G$86:G87, $D$86:D87,\"Direct/Indirect/Clinical Administration\",  $B$86:B87,\"<=\"&$D$83 + 14)+ ((IF(SUMIF(Table132617[Type of Care], \"QI\", Table132617[[Duration ]])>= 4, 4,IF(SUMIF(Table132617[Type of Care], \"QI\", Table132617[[Duration ]])<= 3, SUMIF(Table132617[Type of Care], \"QI\", Table132617[[Duration ]]), 0))))> 90)","v":false}]
[null,null,"",null,null,null,null,{"$f":"IF( B88 > $D$83+14, SUMIFS($G$86:G88, $D$86:D88,\"Direct/Indirect/Clinical Administration\", $B$86:B88,\">\"&$D$83 + 14) + ((IF(SUMIF(Table132617[Type of Care], \"QI\", Table132617[[Duration ]])>= 4, 4,IF(SUMIF(Table132617[Type of Care], \"QI\", Table132617[[Duration ]])<= 3, SUMIF(Table132617[Type of Care], \"QI\", Table132617[[Duration ]]), 0))))  > 90, SUMIFS($G$86:G88, $D$86:D88,\"Direct/Indirect/Clinical Administration\",  $B$86:B88,\"<=\"&$D$83 + 14)+ ((IF(SUMIF(Table132617[Type of Care], \"QI\", Table132617[[Duration ]])>= 4, 4,IF(SUMIF(Table132617[Type of Care], \"QI\", Table132617[[Duration ]])<= 3, SUMIF(Table132617[Type of Care], \"QI\", Table132617[[Duration ]]), 0))))> 90)","v":false}]
[null,null,"",null,null,null,null,{"$f":"IF( B89 > $D$83+14, SUMIFS($G$86:G89, $D$86:D89,\"Direct/Indirect/Clinical Administration\", $B$86:B89,\">\"&$D$83 + 14) + ((IF(SUMIF(Table132617[Type of Care], \"QI\", Table132617[[Duration ]])>= 4, 4,IF(SUMIF(Table132617[Type of Care], \"QI\", Table132617[[Duration ]])<= 3, SUMIF(Table132617[Type of Care], \"QI\", Table132617[[Duration ]]), 0))))  > 90, SUMIFS($G$86:G89, $D$86:D89,\"Direct/Indirect/Clinical Administration\",  $B$86:B89,\"<=\"&$D$83 + 14)+ ((IF(SUMIF(Table132617[Type of Care], \"QI\", Table132617[[Duration ]])>= 4, 4,IF(SUMIF(Table132617[Type of Care], \"QI\", Table132617[[Duration ]])<= 3, SUMIF(Table132617[Type of Care], \"QI\", Table132617[[Duration ]]), 0))))> 90)","v":false}]
[null,null,"",null,null,null,null,{"$f":"IF( B90 > $D$83+14, SUMIFS($G$86:G90, $D$86:D90,\"Direct/Indirect/Clinical Administration\", $B$86:B90,\">\"&$D$83 + 14) + ((IF(SUMIF(Table132617[Type of Care], \"QI\", Table132617[[Duration ]])>= 4, 4,IF(SUMIF(Table132617[Type of Care], \"QI\", Table132617[[Duration ]])<= 3, SUMIF(Table132617[Type of Care], \"QI\", Table132617[[Duration ]]), 0))))  > 90, SUMIFS($G$86:G90, $D$86:D90,\"Direct/Indirect/Clinical Administration\",  $B$86:B90,\"<=\"&$D$83 + 14)+ ((IF(SUMIF(Table132617[Type of Care], \"QI\", Table132617[[Duration ]])>= 4, 4,IF(SUMIF(Table132617[Type of Care], \"QI\", Table132617[[Duration ]])<= 3, SUMIF(Table132617[Type of Care], \"QI\", Table132617[[Duration ]]), 0))))> 90)","v":false}]
[null,null,"",null,null,null,null,{"$f":"IF( B91 > $D$83+14, SUMIFS($G$86:G91, $D$86:D91,\"Direct/Indirect/Clinical Administration\", $B$86:B91,\">\"&$D$83 + 14) + ((IF(SUMIF(Table132617[Type of Care], \"QI\", Table132617[[Duration ]])>= 4, 4,IF(SUMIF(Table132617[Type of Care], \"QI\", Table132617[[Duration ]])<= 3, SUMIF(Table132617[Type of Care], \"QI\", Table132617[[Duration ]]), 0))))  > 90, SUMIFS($G$86:G91, $D$86:D91,\"Direct/Indirect/Clinical Administration\",  $B$86:B91,\"<=\"&$D$83 + 14)+ ((IF(SUMIF(Table132617[Type of Care], \"QI\", Table132617[[Duration ]])>= 4, 4,IF(SUMIF(Table132617[Type of Care], \"QI\", Table132617[[Duration ]])<= 3, SUMIF(Table132617[Type of Care], \"QI\", Table132617[[Duration ]]), 0))))> 90)","v":false}]
[null,null,"",null,null,null,null,{"$f":"IF( B92 > $D$83+14, SUMIFS($G$86:G92, $D$86:D92,\"Direct/Indirect/Clinical Administration\", $B$86:B92,\">\"&$D$83 + 14) + ((IF(SUMIF(Table132617[Type of Care], \"QI\", Table132617[[Duration ]])>= 4, 4,IF(SUMIF(Table132617[Type of Care], \"QI\", Table132617[[Duration ]])<= 3, SUMIF(Table132617[Type of Care], \"QI\", Table132617[[Duration ]]), 0))))  > 90, SUMIFS($G$86:G92, $D$86:D92,\"Direct/Indirect/Clinical Administration\",  $B$86:B92,\"<=\"&$D$83 + 14)+ ((IF(SUMIF(Table132617[Type of Care], \"QI\", Table132617[[Duration ]])>= 4, 4,IF(SUMIF(Table132617[Type of Care], \"QI\", Table132617[[Duration ]])<= 3, SUMIF(Table132617[Type of Care], \"QI\", Table132617[[Duration ]]), 0))))> 90)","v":false}]
[null,null,"",null,null,null,null,{"$f":"IF( B93 > $D$83+14, SUMIFS($G$86:G93, $D$86:D93,\"Direct/Indirect/Clinical Administration\", $B$86:B93,\">\"&$D$83 + 14) + ((IF(SUMIF(Table132617[Type of Care], \"QI\", Table132617[[Duration ]])>= 4, 4,IF(SUMIF(Table132617[Type of Care], \"QI\", Table132617[[Duration ]])<= 3, SUMIF(Table132617[Type of Care], \"QI\", Table132617[[Duration ]]), 0))))  > 90, SUMIFS($G$86:G93, $D$86:D93,\"Direct/Indirect/Clinical Administration\",  $B$86:B93,\"<=\"&$D$83 + 14)+ ((IF(SUMIF(Table132617[Type of Care], \"QI\", Table132617[[Duration ]])>= 4, 4,IF(SUMIF(Table132617[Type of Care], \"QI\", Table132617[[Duration ]])<= 3, SUMIF(Table132617[Type of Care], \"QI\", Table132617[[Duration ]]), 0))))> 90)","v":false}]
[null,null,"",null,null,null,null,{"$f":"IF( B94 > $D$83+14, SUMIFS($G$86:G94, $D$86:D94,\"Direct/Indirect/Clinical Administration\", $B$86:B94,\">\"&$D$83 + 14) + ((IF(SUMIF(Table132617[Type of Care], \"QI\", Table132617[[Duration ]])>= 4, 4,IF(SUMIF(Table132617[Type of Care], \"QI\", Table132617[[Duration ]])<= 3, SUMIF(Table132617[Type of Care], \"QI\", Table132617[[Duration ]]), 0))))  > 90, SUMIFS($G$86:G94, $D$86:D94,\"Direct/Indirect/Clinical Administration\",  $B$86:B94,\"<=\"&$D$83 + 14)+ ((IF(SUMIF(Table132617[Type of Care], \"QI\", Table132617[[Duration ]])>= 4, 4,IF(SUMIF(Table132617[Type of Care], \"QI\", Table132617[[Duration ]])<= 3, SUMIF(Table132617[Type of Care], \"QI\", Table132617[[Duration ]]), 0))))> 90)","v":false}]
[null,null,"",null,null,null,null,{"$f":"IF( B95 > $D$83+14, SUMIFS($G$86:G95, $D$86:D95,\"Direct/Indirect/Clinical Administration\", $B$86:B95,\">\"&$D$83 + 14) + ((IF(SUMIF(Table132617[Type of Care], \"QI\", Table132617[[Duration ]])>= 4, 4,IF(SUMIF(Table132617[Type of Care], \"QI\", Table132617[[Duration ]])<= 3, SUMIF(Table132617[Type of Care], \"QI\", Table132617[[Duration ]]), 0))))  > 90, SUMIFS($G$86:G95, $D$86:D95,\"Direct/Indirect/Clinical Administration\",  $B$86:B95,\"<=\"&$D$83 + 14)+ ((IF(SUMIF(Table132617[Type of Care], \"QI\", Table132617[[Duration ]])>= 4, 4,IF(SUMIF(Table132617[Type of Care], \"QI\", Table132617[[Duration ]])<= 3, SUMIF(Table132617[Type of Care], \"QI\", Table132617[[Duration ]]), 0))))> 90)","v":false}]
[null,null,"",null,null,null,null,{"$f":"IF( B96 > $D$83+14, SUMIFS($G$86:G96, $D$86:D96,\"Direct/Indirect/Clinical Administration\", $B$86:B96,\">\"&$D$83 + 14) + ((IF(SUMIF(Table132617[Type of Care], \"QI\", Table132617[[Duration ]])>= 4, 4,IF(SUMIF(Table132617[Type of Care], \"QI\", Table132617[[Duration ]])<= 3, SUMIF(Table132617[Type of Care], \"QI\", Table132617[[Duration ]]), 0))))  > 90, SUMIFS($G$86:G96, $D$86:D96,\"Direct/Indirect/Clinical Administration\",  $B$86:B96,\"<=\"&$D$83 + 14)+ ((IF(SUMIF(Table132617[Type of Care], \"QI\", Table132617[[Duration ]])>= 4, 4,IF(SUMIF(Table132617[Type of Care], \"QI\", Table132617[[Duration ]])<= 3, SUMIF(Table132617[Type of Care], \"QI\", Table132617[[Duration ]]), 0))))> 90)","v":false}]
[null,null,{"$f":"IF(B97=\"\", \"\", B97)","v":""},null,null,null,null,{"$f":"IF( B97 > $D$83+14, SUMIFS($G$86:G97, $D$86:D97,\"Direct/Indirect/Clinical Administration\", $B$86:B97,\">\"&$D$83 + 14) + ((IF(SUMIF(Table132617[Type of Care], \"QI\", Table132617[[Duration ]])>= 4, 4,IF(SUMIF(Table132617[Type of Care], \"QI\", Table132617[[Duration ]])<= 3, SUMIF(Table132617[Type of Care], \"QI\", Table132617[[Duration ]]), 0))))  > 90, SUMIFS($G$86:G97, $D$86:D97,\"Direct/Indirect/Clinical Administration\",  $B$86:B97,\"<=\"&$D$83 + 14)+ ((IF(SUMIF(Table132617[Type of Care], \"QI\", Table132617[[Duration ]])>= 4, 4,IF(SUMIF(Table132617[Type of Care], \"QI\", Table132617[[Duration ]])<= 3, SUMIF(Table132617[Type of Care], \"QI\", Table132617[[Duration ]]), 0))))> 90)","v":false}]
[null,null,{"$f":"IF(B98=\"\", \"\", B98)","v":""},null,null,null,null,{"$f":"IF( B98 > $D$83+14, SUMIFS($G$86:G98, $D$86:D98,\"Direct/Indirect/Clinical Administration\", $B$86:B98,\">\"&$D$83 + 14) + ((IF(SUMIF(Table132617[Type of Care], \"QI\", Table132617[[Duration ]])>= 4, 4,IF(SUMIF(Table132617[Type of Care], \"QI\", Table132617[[Duration ]])<= 3, SUMIF(Table132617[Type of Care], \"QI\", Table132617[[Duration ]]), 0))))  > 90, SUMIFS($G$86:G98, $D$86:D98,\"Direct/Indirect/Clinical Administration\",  $B$86:B98,\"<=\"&$D$83 + 14)+ ((IF(SUMIF(Table132617[Type of Care], \"QI\", Table132617[[Duration ]])>= 4, 4,IF(SUMIF(Table132617[Type of Care], \"QI\", Table132617[[Duration ]])<= 3, SUMIF(Table132617[Type of Care], \"QI\", Table132617[[Duration ]]), 0))))> 90)","v":false}]
[null,null,"",null,null,null,null,{"$f":"IF( B99 > $D$83+14, SUMIFS($G$86:G99, $D$86:D99,\"Direct/Indirect/Clinical Administration\", $B$86:B99,\">\"&$D$83 + 14) + ((IF(SUMIF(Table132617[Type of Care], \"QI\", Table132617[[Duration ]])>= 4, 4,IF(SUMIF(Table132617[Type of Care], \"QI\", Table132617[[Duration ]])<= 3, SUMIF(Table132617[Type of Care], \"QI\", Table132617[[Duration ]]), 0))))  > 90, SUMIFS($G$86:G99, $D$86:D99,\"Direct/Indirect/Clinical Administration\",  $B$86:B99,\"<=\"&$D$83 + 14)+ ((IF(SUMIF(Table132617[Type of Care], \"QI\", Table132617[[Duration ]])>= 4, 4,IF(SUMIF(Table132617[Type of Care], \"QI\", Table132617[[Duration ]])<= 3, SUMIF(Table132617[Type of Care], \"QI\", Table132617[[Duration ]]), 0))))> 90)","v":false}]
[null,null,"",null,null,null,null,{"$f":"IF( B100 > $D$83+14, SUMIFS($G$86:G100, $D$86:D100,\"Direct/Indirect/Clinical Administration\", $B$86:B100,\">\"&$D$83 + 14) + ((IF(SUMIF(Table132617[Type of Care], \"QI\", Table132617[[Duration ]])>= 4, 4,IF(SUMIF(Table132617[Type of Care], \"QI\", Table132617[[Duration ]])<= 3, SUMIF(Table132617[Type of Care], \"QI\", Table132617[[Duration ]]), 0))))  > 90, SUMIFS($G$86:G100, $D$86:D100,\"Direct/Indirect/Clinical Administration\",  $B$86:B100,\"<=\"&$D$83 + 14)+ ((IF(SUMIF(Table132617[Type of Care], \"QI\", Table132617[[Duration ]])>= 4, 4,IF(SUMIF(Table132617[Type of Care], \"QI\", Table132617[[Duration ]])<= 3, SUMIF(Table132617[Type of Care], \"QI\", Table132617[[Duration ]]), 0))))> 90)","v":false}]
[null,null,"",null,null,null,null,{"$f":"IF( B101 > $D$83+14, SUMIFS($G$86:G101, $D$86:D101,\"Direct/Indirect/Clinical Administration\", $B$86:B101,\">\"&$D$83 + 14) + ((IF(SUMIF(Table132617[Type of Care], \"QI\", Table132617[[Duration ]])>= 4, 4,IF(SUMIF(Table132617[Type of Care], \"QI\", Table132617[[Duration ]])<= 3, SUMIF(Table132617[Type of Care], \"QI\", Table132617[[Duration ]]), 0))))  > 90, SUMIFS($G$86:G101, $D$86:D101,\"Direct/Indirect/Clinical Administration\",  $B$86:B101,\"<=\"&$D$83 + 14)+ ((IF(SUMIF(Table132617[Type of Care], \"QI\", Table132617[[Duration ]])>= 4, 4,IF(SUMIF(Table132617[Type of Care], \"QI\", Table132617[[Duration ]])<= 3, SUMIF(Table132617[Type of Care], \"QI\", Table132617[[Duration ]]), 0))))> 90)","v":false}]
[null,null,"",null,null,null,null,{"$f":"IF( B102 > $D$83+14, SUMIFS($G$86:G102, $D$86:D102,\"Direct/Indirect/Clinical Administration\", $B$86:B102,\">\"&$D$83 + 14) + ((IF(SUMIF(Table132617[Type of Care], \"QI\", Table132617[[Duration ]])>= 4, 4,IF(SUMIF(Table132617[Type of Care], \"QI\", Table132617[[Duration ]])<= 3, SUMIF(Table132617[Type of Care], \"QI\", Table132617[[Duration ]]), 0))))  > 90, SUMIFS($G$86:G102, $D$86:D102,\"Direct/Indirect/Clinical Administration\",  $B$86:B102,\"<=\"&$D$83 + 14)+ ((IF(SUMIF(Table132617[Type of Care], \"QI\", Table132617[[Duration ]])>= 4, 4,IF(SUMIF(Table132617[Type of Care], \"QI\", Table132617[[Duration ]])<= 3, SUMIF(Table132617[Type of Care], \"QI\", Table132617[[Duration ]]), 0))))> 90)","v":false}]
[null,null,"",null,null,null,null,{"$f":"IF( B103 > $D$83+14, SUMIFS($G$86:G103, $D$86:D103,\"Direct/Indirect/Clinical Administration\", $B$86:B103,\">\"&$D$83 + 14) + ((IF(SUMIF(Table132617[Type of Care], \"QI\", Table132617[[Duration ]])>= 4, 4,IF(SUMIF(Table132617[Type of Care], \"QI\", Table132617[[Duration ]])<= 3, SUMIF(Table132617[Type of Care], \"QI\", Table132617[[Duration ]]), 0))))  > 90, SUMIFS($G$86:G103, $D$86:D103,\"Direct/Indirect/Clinical Administration\",  $B$86:B103,\"<=\"&$D$83 + 14)+ ((IF(SUMIF(Table132617[Type of Care], \"QI\", Table132617[[Duration ]])>= 4, 4,IF(SUMIF(Table132617[Type of Care], \"QI\", Table132617[[Duration ]])<= 3, SUMIF(Table132617[Type of Care], \"QI\", Table132617[[Duration ]]), 0))))> 90)","v":false}]
[null,null,{"$f":"IF(B104=\"\", \"\", B104)","v":""},null,null,null,null,{"$f":"IF( B104 > $D$83+14, SUMIFS($G$86:G104, $D$86:D104,\"Direct/Indirect/Clinical Administration\", $B$86:B104,\">\"&$D$83 + 14) + ((IF(SUMIF(Table132617[Type of Care], \"QI\", Table132617[[Duration ]])>= 4, 4,IF(SUMIF(Table132617[Type of Care], \"QI\", Table132617[[Duration ]])<= 3, SUMIF(Table132617[Type of Care], \"QI\", Table132617[[Duration ]]), 0))))  > 90, SUMIFS($G$86:G104, $D$86:D104,\"Direct/Indirect/Clinical Administration\",  $B$86:B104,\"<=\"&$D$83 + 14)+ ((IF(SUMIF(Table132617[Type of Care], \"QI\", Table132617[[Duration ]])>= 4, 4,IF(SUMIF(Table132617[Type of Care], \"QI\", Table132617[[Duration ]])<= 3, SUMIF(Table132617[Type of Care], \"QI\", Table132617[[Duration ]]), 0))))> 90)","v":false}]
[null,null,{"$f":"IF(B105=\"\", \"\", B105)","v":""},null,null,null,null,{"$f":"IF( B105 > $D$83+14, SUMIFS($G$86:G105, $D$86:D105,\"Direct/Indirect/Clinical Administration\", $B$86:B105,\">\"&$D$83 + 14) + ((IF(SUMIF(Table132617[Type of Care], \"QI\", Table132617[[Duration ]])>= 4, 4,IF(SUMIF(Table132617[Type of Care], \"QI\", Table132617[[Duration ]])<= 3, SUMIF(Table132617[Type of Care], \"QI\", Table132617[[Duration ]]), 0))))  > 90, SUMIFS($G$86:G105, $D$86:D105,\"Direct/Indirect/Clinical Administration\",  $B$86:B105,\"<=\"&$D$83 + 14)+ ((IF(SUMIF(Table132617[Type of Care], \"QI\", Table132617[[Duration ]])>= 4, 4,IF(SUMIF(Table132617[Type of Care], \"QI\", Table132617[[Duration ]])<= 3, SUMIF(Table132617[Type of Care], \"QI\", Table132617[[Duration ]]), 0))))> 90)","v":false}]
[null,null,{"$f":"IF(B106=\"\", \"\", B106)","v":""},null,null,null,null,{"$f":"IF( B106 > $D$83+14, SUMIFS($G$86:G106, $D$86:D106,\"Direct/Indirect/Clinical Administration\", $B$86:B106,\">\"&$D$83 + 14) + ((IF(SUMIF(Table132617[Type of Care], \"QI\", Table132617[[Duration ]])>= 4, 4,IF(SUMIF(Table132617[Type of Care], \"QI\", Table132617[[Duration ]])<= 3, SUMIF(Table132617[Type of Care], \"QI\", Table132617[[Duration ]]), 0))))  > 90, SUMIFS($G$86:G106, $D$86:D106,\"Direct/Indirect/Clinical Administration\",  $B$86:B106,\"<=\"&$D$83 + 14)+ ((IF(SUMIF(Table132617[Type of Care], \"QI\", Table132617[[Duration ]])>= 4, 4,IF(SUMIF(Table132617[Type of Care], \"QI\", Table132617[[Duration ]])<= 3, SUMIF(Table132617[Type of Care], \"QI\", Table132617[[Duration ]]), 0))))> 90)","v":false}]
[null,null,{"$f":"IF(B107=\"\", \"\", B107)","v":""},null,null,null,null,{"$f":"IF( B107 > $D$83+14, SUMIFS($G$86:G107, $D$86:D107,\"Direct/Indirect/Clinical Administration\", $B$86:B107,\">\"&$D$83 + 14) + ((IF(SUMIF(Table132617[Type of Care], \"QI\", Table132617[[Duration ]])>= 4, 4,IF(SUMIF(Table132617[Type of Care], \"QI\", Table132617[[Duration ]])<= 3, SUMIF(Table132617[Type of Care], \"QI\", Table132617[[Duration ]]), 0))))  > 90, SUMIFS($G$86:G107, $D$86:D107,\"Direct/Indirect/Clinical Administration\",  $B$86:B107,\"<=\"&$D$83 + 14)+ ((IF(SUMIF(Table132617[Type of Care], \"QI\", Table132617[[Duration ]])>= 4, 4,IF(SUMIF(Table132617[Type of Care], \"QI\", Table132617[[Duration ]])<= 3, SUMIF(Table132617[Type of Care], \"QI\", Table132617[[Duration ]]), 0))))> 90)","v":false}]
[null,null,"",null,null,null,null,{"$f":"IF( B108 > $D$83+14, SUMIFS($G$86:G108, $D$86:D108,\"Direct/Indirect/Clinical Administration\", $B$86:B108,\">\"&$D$83 + 14) + ((IF(SUMIF(Table132617[Type of Care], \"QI\", Table132617[[Duration ]])>= 4, 4,IF(SUMIF(Table132617[Type of Care], \"QI\", Table132617[[Duration ]])<= 3, SUMIF(Table132617[Type of Care], \"QI\", Table132617[[Duration ]]), 0))))  > 90, SUMIFS($G$86:G108, $D$86:D108,\"Direct/Indirect/Clinical Administration\",  $B$86:B108,\"<=\"&$D$83 + 14)+ ((IF(SUMIF(Table132617[Type of Care], \"QI\", Table132617[[Duration ]])>= 4, 4,IF(SUMIF(Table132617[Type of Care], \"QI\", Table132617[[Duration ]])<= 3, SUMIF(Table132617[Type of Care], \"QI\", Table132617[[Duration ]]), 0))))> 90)","v":false}]
[null,null,"",null,null,null,null,{"$f":"IF( B109 > $D$83+14, SUMIFS($G$86:G109, $D$86:D109,\"Direct/Indirect/Clinical Administration\", $B$86:B109,\">\"&$D$83 + 14) + ((IF(SUMIF(Table132617[Type of Care], \"QI\", Table132617[[Duration ]])>= 4, 4,IF(SUMIF(Table132617[Type of Care], \"QI\", Table132617[[Duration ]])<= 3, SUMIF(Table132617[Type of Care], \"QI\", Table132617[[Duration ]]), 0))))  > 90, SUMIFS($G$86:G109, $D$86:D109,\"Direct/Indirect/Clinical Administration\",  $B$86:B109,\"<=\"&$D$83 + 14)+ ((IF(SUMIF(Table132617[Type of Care], \"QI\", Table132617[[Duration ]])>= 4, 4,IF(SUMIF(Table132617[Type of Care], \"QI\", Table132617[[Duration ]])<= 3, SUMIF(Table132617[Type of Care], \"QI\", Table132617[[Duration ]]), 0))))> 90)","v":false}]
[null,null,{"$f":"IF(B110=\"\", \"\", B110)","v":""},null,null,null,null,{"$f":"IF( B110 > $D$83+14, SUMIFS($G$86:G110, $D$86:D110,\"Direct/Indirect/Clinical Administration\", $B$86:B110,\">\"&$D$83 + 14) + ((IF(SUMIF(Table132617[Type of Care], \"QI\", Table132617[[Duration ]])>= 4, 4,IF(SUMIF(Table132617[Type of Care], \"QI\", Table132617[[Duration ]])<= 3, SUMIF(Table132617[Type of Care], \"QI\", Table132617[[Duration ]]), 0))))  > 90, SUMIFS($G$86:G110, $D$86:D110,\"Direct/Indirect/Clinical Administration\",  $B$86:B110,\"<=\"&$D$83 + 14)+ ((IF(SUMIF(Table132617[Type of Care], \"QI\", Table132617[[Duration ]])>= 4, 4,IF(SUMIF(Table132617[Type of Care], \"QI\", Table132617[[Duration ]])<= 3, SUMIF(Table132617[Type of Care], \"QI\", Table132617[[Duration ]]), 0))))> 90)","v":false}]
[null,null,{"$f":"IF(B111=\"\", \"\", B111)","v":""},null,null,null,null,{"$f":"IF( B111 > $D$83+14, SUMIFS($G$86:G111, $D$86:D111,\"Direct/Indirect/Clinical Administration\", $B$86:B111,\">\"&$D$83 + 14) + ((IF(SUMIF(Table132617[Type of Care], \"QI\", Table132617[[Duration ]])>= 4, 4,IF(SUMIF(Table132617[Type of Care], \"QI\", Table132617[[Duration ]])<= 3, SUMIF(Table132617[Type of Care], \"QI\", Table132617[[Duration ]]), 0))))  > 90, SUMIFS($G$86:G111, $D$86:D111,\"Direct/Indirect/Clinical Administration\",  $B$86:B111,\"<=\"&$D$83 + 14)+ ((IF(SUMIF(Table132617[Type of Care], \"QI\", Table132617[[Duration ]])>= 4, 4,IF(SUMIF(Table132617[Type of Care], \"QI\", Table132617[[Duration ]])<= 3, SUMIF(Table132617[Type of Care], \"QI\", Table132617[[Duration ]]), 0))))> 90)","v":false}]
[null,null,{"$f":"IF(B112=\"\", \"\", B112)","v":""},null,null,null,null,{"$f":"IF( B112 > $D$83+14, SUMIFS($G$86:G112, $D$86:D112,\"Direct/Indirect/Clinical Administration\", $B$86:B112,\">\"&$D$83 + 14) + ((IF(SUMIF(Table132617[Type of Care], \"QI\", Table132617[[Duration ]])>= 4, 4,IF(SUMIF(Table132617[Type of Care], \"QI\", Table132617[[Duration ]])<= 3, SUMIF(Table132617[Type of Care], \"QI\", Table132617[[Duration ]]), 0))))  > 90, SUMIFS($G$86:G112, $D$86:D112,\"Direct/Indirect/Clinical Administration\",  $B$86:B112,\"<=\"&$D$83 + 14)+ ((IF(SUMIF(Table132617[Type of Care], \"QI\", Table132617[[Duration ]])>= 4, 4,IF(SUMIF(Table132617[Type of Care], \"QI\", Table132617[[Duration ]])<= 3, SUMIF(Table132617[Type of Care], \"QI\", Table132617[[Duration ]]), 0))))> 90)","v":false}]
[null,null,{"$f":"IF(B113=\"\", \"\", B113)","v":""},null,null,null,null,{"$f":"IF( B113 > $D$83+14, SUMIFS($G$86:G113, $D$86:D113,\"Direct/Indirect/Clinical Administration\", $B$86:B113,\">\"&$D$83 + 14) + ((IF(SUMIF(Table132617[Type of Care], \"QI\", Table132617[[Duration ]])>= 4, 4,IF(SUMIF(Table132617[Type of Care], \"QI\", Table132617[[Duration ]])<= 3, SUMIF(Table132617[Type of Care], \"QI\", Table132617[[Duration ]]), 0))))  > 90, SUMIFS($G$86:G113, $D$86:D113,\"Direct/Indirect/Clinical Administration\",  $B$86:B113,\"<=\"&$D$83 + 14)+ ((IF(SUMIF(Table132617[Type of Care], \"QI\", Table132617[[Duration ]])>= 4, 4,IF(SUMIF(Table132617[Type of Care], \"QI\", Table132617[[Duration ]])<= 3, SUMIF(Table132617[Type of Care], \"QI\", Table132617[[Duration ]]), 0))))> 90)","v":false}]
[null,null,{"$f":"IF(B114=\"\", \"\", B114)","v":""},null,null,null,null,{"$f":"IF( B114 > $D$83+14, SUMIFS($G$86:G114, $D$86:D114,\"Direct/Indirect/Clinical Administration\", $B$86:B114,\">\"&$D$83 + 14) + ((IF(SUMIF(Table132617[Type of Care], \"QI\", Table132617[[Duration ]])>= 4, 4,IF(SUMIF(Table132617[Type of Care], \"QI\", Table132617[[Duration ]])<= 3, SUMIF(Table132617[Type of Care], \"QI\", Table132617[[Duration ]]), 0))))  > 90, SUMIFS($G$86:G114, $D$86:D114,\"Direct/Indirect/Clinical Administration\",  $B$86:B114,\"<=\"&$D$83 + 14)+ ((IF(SUMIF(Table132617[Type of Care], \"QI\", Table132617[[Duration ]])>= 4, 4,IF(SUMIF(Table132617[Type of Care], \"QI\", Table132617[[Duration ]])<= 3, SUMIF(Table132617[Type of Care], \"QI\", Table132617[[Duration ]]), 0))))> 90)","v":false}]
[null,null,{"$f":"IF(B115=\"\", \"\", B115)","v":""},null,null,"Total Contract Hours",{"$f":"(SUMIF(Table132617[Type of Care], \"Direct/Indirect/Clinical Administration\",Table132617[[Duration ]]))","v":0},"CT3"]
[null,null,null,null,null,"Total Included QI Hours",{"$f":"(IF(SUMIF(Table132617[Type of Care], \"QI\", Table132617[[Duration ]])>= 4, 4,IF(SUMIF(Table132617[Type of Care], \"QI\", Table132617[[Duration ]])<= 3, SUMIF(Table132617[Type of Care], \"QI\", Table132617[[Duration ]]), 0)))","v":0},"QI3"]
[null,null,null,null,null,"Total Excluded Hours",{"$f":"G118+G119","v":0},"EX3"]
[null,null,null,null,null,"         Excluded Contract Hours",{"$f":"(SUMIF(Table132617[Type of Care], \"Third Party/Specialist FFS\",Table132617[[Duration ]])) + (SUMIF(Table132617[Type of Care], \"Break (>15 Minutes)\", Table132617[[Duration ]]))","v":0},"EXC3"]
[null,null,null,null,null,"      Excluded QI Hours",{"$f":"(SUMIF(Table132617[Type of Care], \"QI\", Table132617[[Duration ]]) - (IF(SUMIF(Table132617[Type of Care], \"QI\", Table132617[[Duration ]])>= 4, 4,IF(SUMIF(Table132617[Type of Care], \"QI\", Table132617[[Duration ]])<= 3, SUMIF(Table132617[Type of Care], \"QI\", Table132617[[Duration ]]), 0))))","v":0},"EXQI3"]
[null,null,{"$f":"IF(B120=\"\", \"\", B120)","v":""},null,null,"Hours Above 90hr/semi-monthly",{"$f":"  (IF(SUMIFS(Table132617[[Duration ]],Table132617[Date (YYYY-MM-DD)], \">\"&$D$83+14, Table132617[Type of Care], \"Direct/Indirect/Clinical Administration\")>= 90, (SUMIFS(Table132617[[Duration ]],Table132617[Date (YYYY-MM-DD)], \">\"&$D$83+14, Table132617[Type of Care], \"Direct/Indirect/Clinical Administration\")+ (IF(SUMIF(Table132617[Type of Care], \"QI\", Table132617[[Duration ]])>= 4, 4,IF(SUMIF(Table132617[Type of Care], \"QI\", Table132617[[Duration ]])<= 3, SUMIF(Table132617[Type of Care], \"QI\",Table132617[[Duration ]]), 0))) -90))) + (IF(SUMIFS(Table132617[[Duration ]],Table132617[Date (YYYY-MM-DD)], \"<=\"&$D$83+14, Table132617[Type of Care], \"Direct/Indirect/Clinical Administration\")>= 90, (SUMIFS(Table132617[[Duration ]],Table132617[Date (YYYY-MM-DD)], \"<=\"&$D$83+14, Table132617[Type of Care], \"Direct/Indirect/Clinical Administration\")+ (IF(SUMIF(Table132617[Type of Care], \"QI\", Table132617[[Duration ]])>= 4, 4,IF(SUMIF(Table132617[Type of Care], \"QI\", Table132617[[Duration ]])<= 3, SUMIF(Table132617[Type of Care], \"QI\",Table132617[[Duration ]]), 0))) -90)))","v":0},"A903"]

{"sheet":"Physician 3","index":3,"n_rows":120,"n_cols":8,"rows_kept":120,"cut":false,"hidden":false,"merged":[]}
[]
[null,"[Physician Name]"]
[null,"Practitioner #:",0]
[null,"Annual Rate: ",0]
[null,"Qrt. Disbursement: ",0]
[null,null,"Jan - Mar"]
[null,"Total Contract \nHours","Total Included \nQI Hours","Excluded Contract \nHours"]
[null,{"$f":"G35+G75+G115","v":0},{"$f":"G36+G76+G116","v":0},{"$f":"G37+G77+G117","v":0},null,null,null,"Totals"]
[]
[null,{"$f":"IF(Clinic!C5=\"Jan - Mar\", \"January\", IF(Clinic!C5= \"Apr - June\", \"April\", IF(Clinic!C5=\"July - Sept\", \"July\", IF(Clinic!C5=\" Oct - Dec\", \"October\"))))","v":"January"},{"$f":"Clinic!C6","v":2021},{"$f":"DATE(YEAR(B13),MONTH(DATEVALUE(B10&\"1\")),1)","v":"1900-01-01"},null,null,null,"Month1"]
[]
[null,"Date (YYYY-MM-DD)","Day ","Type of Care","Start Time AM/PM","End Time AM/PM","Duration","FALSE/TRUE"]
[null,null,{"$f":"IF(B13=\"\", \"\", B13)","v":""},null,null,null,null,{"$f":"IF( B13 > $D$10+14, SUMIFS($G$13:G13, $D$13:D13,\"Direct/Indirect/Clinical Administration\", $B$13:B13,\">\"&$D$10 + 14) + ((IF(SUMIF(Table131518[Type of Care], \"QI\", Table131518[Duration])>= 4, 4,IF(SUMIF(Table131518[Type of Care], \"QI\", Table131518[Duration])<= 3, SUMIF(Table131518[Type of Care], \"QI\", Table131518[Duration]), 0))))  > 90, SUMIFS($G$13:G13, $D$13:D13,\"Direct/Indirect/Clinical Administration\",  $B$13:B13,\"<=\"&$D$10 + 14)+ ((IF(SUMIF(Table131518[Type of Care], \"QI\", Table131518[Duration])>= 4, 4,IF(SUMIF(Table131518[Type of Care], \"QI\", Table131518[Duration])<= 3, SUMIF(Table131518[Type of Care], \"QI\", Table131518[Duration]), 0))))> 90)","v":false}]
[null,null,{"$f":"IF(B14=\"\", \"\", B14)","v":""},null,null,null,null,{"$f":"IF( B14 > $D$10+14, SUMIFS($G$13:G14, $D$13:D14,\"Direct/Indirect/Clinical Administration\", $B$13:B14,\">\"&$D$10 + 14) + ((IF(SUMIF(Table131518[Type of Care], \"QI\", Table131518[Duration])>= 4, 4,IF(SUMIF(Table131518[Type of Care], \"QI\", Table131518[Duration])<= 3, SUMIF(Table131518[Type of Care], \"QI\", Table131518[Duration]), 0))))  > 90, SUMIFS($G$13:G14, $D$13:D14,\"Direct/Indirect/Clinical Administration\",  $B$13:B14,\"<=\"&$D$10 + 14)+ ((IF(SUMIF(Table131518[Type of Care], \"QI\", Table131518[Duration])>= 4, 4,IF(SUMIF(Table131518[Type of Care], \"QI\", Table131518[Duration])<= 3, SUMIF(Table131518[Type of Care], \"QI\", Table131518[Duration]), 0))))> 90)","v":false}]
[null,null,"",null,null,null,null,{"$f":"IF( B15 > $D$10+14, SUMIFS($G$13:G15, $D$13:D15,\"Direct/Indirect/Clinical Administration\", $B$13:B15,\">\"&$D$10 + 14) + ((IF(SUMIF(Table131518[Type of Care], \"QI\", Table131518[Duration])>= 4, 4,IF(SUMIF(Table131518[Type of Care], \"QI\", Table131518[Duration])<= 3, SUMIF(Table131518[Type of Care], \"QI\", Table131518[Duration]), 0))))  > 90, SUMIFS($G$13:G15, $D$13:D15,\"Direct/Indirect/Clinical Administration\",  $B$13:B15,\"<=\"&$D$10 + 14)+ ((IF(SUMIF(Table131518[Type of Care], \"QI\", Table131518[Duration])>= 4, 4,IF(SUMIF(Table131518[Type of Care], \"QI\", Table131518[Duration])<= 3, SUMIF(Table131518[Type of Care], \"QI\", Table131518[Duration]), 0))))> 90)","v":false}]
[null,null,"",null,null,null,null,{"$f":"IF( B16 > $D$10+14, SUMIFS($G$13:G16, $D$13:D16,\"Direct/Indirect/Clinical Administration\", $B$13:B16,\">\"&$D$10 + 14) + ((IF(SUMIF(Table131518[Type of Care], \"QI\", Table131518[Duration])>= 4, 4,IF(SUMIF(Table131518[Type of Care], \"QI\", Table131518[Duration])<= 3, SUMIF(Table131518[Type of Care], \"QI\", Table131518[Duration]), 0))))  > 90, SUMIFS($G$13:G16, $D$13:D16,\"Direct/Indirect/Clinical Administration\",  $B$13:B16,\"<=\"&$D$10 + 14)+ ((IF(SUMIF(Table131518[Type of Care], \"QI\", Table131518[Duration])>= 4, 4,IF(SUMIF(Table131518[Type of Care], \"QI\", Table131518[Duration])<= 3, SUMIF(Table131518[Type of Care], \"QI\", Table131518[Duration]), 0))))> 90)","v":false}]
[null,null,"",null,null,null,null,{"$f":"IF( B17 > $D$10+14, SUMIFS($G$13:G17, $D$13:D17,\"Direct/Indirect/Clinical Administration\", $B$13:B17,\">\"&$D$10 + 14) + ((IF(SUMIF(Table131518[Type of Care], \"QI\", Table131518[Duration])>= 4, 4,IF(SUMIF(Table131518[Type of Care], \"QI\", Table131518[Duration])<= 3, SUMIF(Table131518[Type of Care], \"QI\", Table131518[Duration]), 0))))  > 90, SUMIFS($G$13:G17, $D$13:D17,\"Direct/Indirect/Clinical Administration\",  $B$13:B17,\"<=\"&$D$10 + 14)+ ((IF(SUMIF(Table131518[Type of Care], \"QI\", Table131518[Duration])>= 4, 4,IF(SUMIF(Table131518[Type of Care], \"QI\", Table131518[Duration])<= 3, SUMIF(Table131518[Type of Care], \"QI\", Table131518[Duration]), 0))))> 90)","v":false}]
[null,null,"",null,null,null,null,{"$f":"IF( B18 > $D$10+14, SUMIFS($G$13:G18, $D$13:D18,\"Direct/Indirect/Clinical Administration\", $B$13:B18,\">\"&$D$10 + 14) + ((IF(SUMIF(Table131518[Type of Care], \"QI\", Table131518[Duration])>= 4, 4,IF(SUMIF(Table131518[Type of Care], \"QI\", Table131518[Duration])<= 3, SUMIF(Table131518[Type of Care], \"QI\", Table131518[Duration]), 0))))  > 90, SUMIFS($G$13:G18, $D$13:D18,\"Direct/Indirect/Clinical Administration\",  $B$13:B18,\"<=\"&$D$10 + 14)+ ((IF(SUMIF(Table131518[Type of Care], \"QI\", Table131518[Duration])>= 4, 4,IF(SUMIF(Table131518[Type of Care], \"QI\", Table131518[Duration])<= 3, SUMIF(Table131518[Type of Care], \"QI\", Table131518[Duration]), 0))))> 90)","v":false}]
[null,null,"",null,null,null,null,{"$f":"IF( B19 > $D$10+14, SUMIFS($G$13:G19, $D$13:D19,\"Direct/Indirect/Clinical Administration\", $B$13:B19,\">\"&$D$10 + 14) + ((IF(SUMIF(Table131518[Type of Care], \"QI\", Table131518[Duration])>= 4, 4,IF(SUMIF(Table131518[Type of Care], \"QI\", Table131518[Duration])<= 3, SUMIF(Table131518[Type of Care], \"QI\", Table131518[Duration]), 0))))  > 90, SUMIFS($G$13:G19, $D$13:D19,\"Direct/Indirect/Clinical Administration\",  $B$13:B19,\"<=\"&$D$10 + 14)+ ((IF(SUMIF(Table131518[Type of Care], \"QI\", Table131518[Duration])>= 4, 4,IF(SUMIF(Table131518[Type of Care], \"QI\", Table131518[Duration])<= 3, SUMIF(Table131518[Type of Care], \"QI\", Table131518[Duration]), 0))))> 90)","v":false}]
[null,null,"",null,null,null,null,{"$f":"IF( B20 > $D$10+14, SUMIFS($G$13:G20, $D$13:D20,\"Direct/Indirect/Clinical Administration\", $B$13:B20,\">\"&$D$10 + 14) + ((IF(SUMIF(Table131518[Type of Care], \"QI\", Table131518[Duration])>= 4, 4,IF(SUMIF(Table131518[Type of Care], \"QI\", Table131518[Duration])<= 3, SUMIF(Table131518[Type of Care], \"QI\", Table131518[Duration]), 0))))  > 90, SUMIFS($G$13:G20, $D$13:D20,\"Direct/Indirect/Clinical Administration\",  $B$13:B20,\"<=\"&$D$10 + 14)+ ((IF(SUMIF(Table131518[Type of Care], \"QI\", Table131518[Duration])>= 4, 4,IF(SUMIF(Table131518[Type of Care], \"QI\", Table131518[Duration])<= 3, SUMIF(Table131518[Type of Care], \"QI\", Table131518[Duration]), 0))))> 90)","v":false}]
[null,null,"",null,null,null,null,{"$f":"IF( B21 > $D$10+14, SUMIFS($G$13:G21, $D$13:D21,\"Direct/Indirect/Clinical Administration\", $B$13:B21,\">\"&$D$10 + 14) + ((IF(SUMIF(Table131518[Type of Care], \"QI\", Table131518[Duration])>= 4, 4,IF(SUMIF(Table131518[Type of Care], \"QI\", Table131518[Duration])<= 3, SUMIF(Table131518[Type of Care], \"QI\", Table131518[Duration]), 0))))  > 90, SUMIFS($G$13:G21, $D$13:D21,\"Direct/Indirect/Clinical Administration\",  $B$13:B21,\"<=\"&$D$10 + 14)+ ((IF(SUMIF(Table131518[Type of Care], \"QI\", Table131518[Duration])>= 4, 4,IF(SUMIF(Table131518[Type of Care], \"QI\", Table131518[Duration])<= 3, SUMIF(Table131518[Type of Care], \"QI\", Table131518[Duration]), 0))))> 90)","v":false}]
[null,null,"",null,null,null,null,{"$f":"IF( B22 > $D$10+14, SUMIFS($G$13:G22, $D$13:D22,\"Direct/Indirect/Clinical Administration\", $B$13:B22,\">\"&$D$10 + 14) + ((IF(SUMIF(Table131518[Type of Care], \"QI\", Table131518[Duration])>= 4, 4,IF(SUMIF(Table131518[Type of Care], \"QI\", Table131518[Duration])<= 3, SUMIF(Table131518[Type of Care], \"QI\", Table131518[Duration]), 0))))  > 90, SUMIFS($G$13:G22, $D$13:D22,\"Direct/Indirect/Clinical Administration\",  $B$13:B22,\"<=\"&$D$10 + 14)+ ((IF(SUMIF(Table131518[Type of Care], \"QI\", Table131518[Duration])>= 4, 4,IF(SUMIF(Table131518[Type of Care], \"QI\", Table131518[Duration])<= 3, SUMIF(Table131518[Type of Care], \"QI\", Table131518[Duration]), 0))))> 90)","v":false}]
[null,null,{"$f":"IF(B23=\"\", \"\", B23)","v":""},null,null,null,null,{"$f":"IF( B23 > $D$10+14, SUMIFS($G$13:G23, $D$13:D23,\"Direct/Indirect/Clinical Administration\", $B$13:B23,\">\"&$D$10 + 14) + ((IF(SUMIF(Table131518[Type of Care], \"QI\", Table131518[Duration])>= 4, 4,IF(SUMIF(Table131518[Type of Care], \"QI\", Table131518[Duration])<= 3, SUMIF(Table131518[Type of Care], \"QI\", Table131518[Duration]), 0))))  > 90, SUMIFS($G$13:G23, $D$13:D23,\"Direct/Indirect/Clinical Administration\",  $B$13:B23,\"<=\"&$D$10 + 14)+ ((IF(SUMIF(Table131518[Type of Care], \"QI\", Table131518[Duration])>= 4, 4,IF(SUMIF(Table131518[Type of Care], \"QI\", Table131518[Duration])<= 3, SUMIF(Table131518[Type of Care], \"QI\", Table131518[Duration]), 0))))> 90)","v":false}]
[null,null,"",null,null,null,null,{"$f":"IF( B24 > $D$10+14, SUMIFS($G$13:G24, $D$13:D24,\"Direct/Indirect/Clinical Administration\", $B$13:B24,\">\"&$D$10 + 14) + ((IF(SUMIF(Table131518[Type of Care], \"QI\", Table131518[Duration])>= 4, 4,IF(SUMIF(Table131518[Type of Care], \"QI\", Table131518[Duration])<= 3, SUMIF(Table131518[Type of Care], \"QI\", Table131518[Duration]), 0))))  > 90, SUMIFS($G$13:G24, $D$13:D24,\"Direct/Indirect/Clinical Administration\",  $B$13:B24,\"<=\"&$D$10 + 14)+ ((IF(SUMIF(Table131518[Type of Care], \"QI\", Table131518[Duration])>= 4, 4,IF(SUMIF(Table131518[Type of Care], \"QI\", Table131518[Duration])<= 3, SUMIF(Table131518[Type of Care], \"QI\", Table131518[Duration]), 0))))> 90)","v":false}]
[null,null,"",null,null,null,null,{"$f":"IF( B25 > $D$10+14, SUMIFS($G$13:G25, $D$13:D25,\"Direct/Indirect/Clinical Administration\", $B$13:B25,\">\"&$D$10 + 14) + ((IF(SUMIF(Table131518[Type of Care], \"QI\", Table131518[Duration])>= 4, 4,IF(SUMIF(Table131518[Type of Care], \"QI\", Table131518[Duration])<= 3, SUMIF(Table131518[Type of Care], \"QI\", Table131518[Duration]), 0))))  > 90, SUMIFS($G$13:G25, $D$13:D25,\"Direct/Indirect/Clinical Administration\",  $B$13:B25,\"<=\"&$D$10 + 14)+ ((IF(SUMIF(Table131518[Type of Care], \"QI\", Table131518[Duration])>= 4, 4,IF(SUMIF(Table131518[Type of Care], \"QI\", Table131518[Duration])<= 3, SUMIF(Table131518[Type of Care], \"QI\", Table131518[Duration]), 0))))> 90)","v":false}]
[null,null,"",null,null,null,null,{"$f":"IF( B26 > $D$10+14, SUMIFS($G$13:G26, $D$13:D26,\"Direct/Indirect/Clinical Administration\", $B$13:B26,\">\"&$D$10 + 14) + ((IF(SUMIF(Table131518[Type of Care], \"QI\", Table131518[Duration])>= 4, 4,IF(SUMIF(Table131518[Type of Care], \"QI\", Table131518[Duration])<= 3, SUMIF(Table131518[Type of Care], \"QI\", Table131518[Duration]), 0))))  > 90, SUMIFS($G$13:G26, $D$13:D26,\"Direct/Indirect/Clinical Administration\",  $B$13:B26,\"<=\"&$D$10 + 14)+ ((IF(SUMIF(Table131518[Type of Care], \"QI\", Table131518[Duration])>= 4, 4,IF(SUMIF(Table131518[Type of Care], \"QI\", Table131518[Duration])<= 3, SUMIF(Table131518[Type of Care], \"QI\", Table131518[Duration]), 0))))> 90)","v":false}]
[null,null,"",null,null,null,null,{"$f":"IF( B27 > $D$10+14, SUMIFS($G$13:G27, $D$13:D27,\"Direct/Indirect/Clinical Administration\", $B$13:B27,\">\"&$D$10 + 14) + ((IF(SUMIF(Table131518[Type of Care], \"QI\", Table131518[Duration])>= 4, 4,IF(SUMIF(Table131518[Type of Care], \"QI\", Table131518[Duration])<= 3, SUMIF(Table131518[Type of Care], \"QI\", Table131518[Duration]), 0))))  > 90, SUMIFS($G$13:G27, $D$13:D27,\"Direct/Indirect/Clinical Administration\",  $B$13:B27,\"<=\"&$D$10 + 14)+ ((IF(SUMIF(Table131518[Type of Care], \"QI\", Table131518[Duration])>= 4, 4,IF(SUMIF(Table131518[Type of Care], \"QI\", Table131518[Duration])<= 3, SUMIF(Table131518[Type of Care], \"QI\", Table131518[Duration]), 0))))> 90)","v":false}]
[null,null,"",null,null,null,null,{"$f":"IF( B28 > $D$10+14, SUMIFS($G$13:G28, $D$13:D28,\"Direct/Indirect/Clinical Administration\", $B$13:B28,\">\"&$D$10 + 14) + ((IF(SUMIF(Table131518[Type of Care], \"QI\", Table131518[Duration])>= 4, 4,IF(SUMIF(Table131518[Type of Care], \"QI\", Table131518[Duration])<= 3, SUMIF(Table131518[Type of Care], \"QI\", Table131518[Duration]), 0))))  > 90, SUMIFS($G$13:G28, $D$13:D28,\"Direct/Indirect/Clinical Administration\",  $B$13:B28,\"<=\"&$D$10 + 14)+ ((IF(SUMIF(Table131518[Type of Care], \"QI\", Table131518[Duration])>= 4, 4,IF(SUMIF(Table131518[Type of Care], \"QI\", Table131518[Duration])<= 3, SUMIF(Table131518[Type of Care], \"QI\", Table131518[Duration]), 0))))> 90)","v":false}]
[null,null,"",null,null,null,null,{"$f":"IF( B29 > $D$10+14, SUMIFS($G$13:G29, $D$13:D29,\"Direct/Indirect/Clinical Administration\", $B$13:B29,\">\"&$D$10 + 14) + ((IF(SUMIF(Table131518[Type of Care], \"QI\", Table131518[Duration])>= 4, 4,IF(SUMIF(Table131518[Type of Care], \"QI\", Table131518[Duration])<= 3, SUMIF(Table131518[Type of Care], \"QI\", Table131518[Duration]), 0))))  > 90, SUMIFS($G$13:G29, $D$13:D29,\"Direct/Indirect/Clinical Administration\",  $B$13:B29,\"<=\"&$D$10 + 14)+ ((IF(SUMIF(Table131518[Type of Care], \"QI\", Table131518[Duration])>= 4, 4,IF(SUMIF(Table131518[Type of Care], \"QI\", Table131518[Duration])<= 3, SUMIF(Table131518[Type of Care], \"QI\", Table131518[Duration]), 0))))> 90)","v":false}]
[null,null,"",null,null,null,null,{"$f":"IF( B30 > $D$10+14, SUMIFS($G$13:G30, $D$13:D30,\"Direct/Indirect/Clinical Administration\", $B$13:B30,\">\"&$D$10 + 14) + ((IF(SUMIF(Table131518[Type of Care], \"QI\", Table131518[Duration])>= 4, 4,IF(SUMIF(Table131518[Type of Care], \"QI\", Table131518[Duration])<= 3, SUMIF(Table131518[Type of Care], \"QI\", Table131518[Duration]), 0))))  > 90, SUMIFS($G$13:G30, $D$13:D30,\"Direct/Indirect/Clinical Administration\",  $B$13:B30,\"<=\"&$D$10 + 14)+ ((IF(SUMIF(Table131518[Type of Care], \"QI\", Table131518[Duration])>= 4, 4,IF(SUMIF(Table131518[Type of Care], \"QI\", Table131518[Duration])<= 3, SUMIF(Table131518[Type of Care], \"QI\", Table131518[Duration]), 0))))> 90)","v":false}]
[null,null,{"$f":"IF(B31=\"\", \"\", B31)","v":""},null,null,null,null,{"$f":"IF( B31 > $D$10+14, SUMIFS($G$13:G31, $D$13:D31,\"Direct/Indirect/Clinical Administration\", $B$13:B31,\">\"&$D$10 + 14) + ((IF(SUMIF(Table131518[Type of Care], \"QI\", Table131518[Duration])>= 4, 4,IF(SUMIF(Table131518[Type of Care], \"QI\", Table131518[Duration])<= 3, SUMIF(Table131518[Type of Care], \"QI\", Table131518[Duration]), 0))))  > 90, SUMIFS($G$13:G31, $D$13:D31,\"Direct/Indirect/Clinical Administration\",  $B$13:B31,\"<=\"&$D$10 + 14)+ ((IF(SUMIF(Table131518[Type of Care], \"QI\", Table131518[Duration])>= 4, 4,IF(SUMIF(Table131518[Type of Care], \"QI\", Table131518[Duration])<= 3, SUMIF(Table131518[Type of Care], \"QI\", Table131518[Duration]), 0))))> 90)","v":false}]
[null,null,{"$f":"IF(B32=\"\", \"\", B32)","v":""},null,null,null,null,{"$f":"IF( B32 > $D$10+14, SUMIFS($G$13:G32, $D$13:D32,\"Direct/Indirect/Clinical Administration\", $B$13:B32,\">\"&$D$10 + 14) + ((IF(SUMIF(Table131518[Type of Care], \"QI\", Table131518[Duration])>= 4, 4,IF(SUMIF(Table131518[Type of Care], \"QI\", Table131518[Duration])<= 3, SUMIF(Table131518[Type of Care], \"QI\", Table131518[Duration]), 0))))  > 90, SUMIFS($G$13:G32, $D$13:D32,\"Direct/Indirect/Clinical Administration\",  $B$13:B32,\"<=\"&$D$10 + 14)+ ((IF(SUMIF(Table131518[Type of Care], \"QI\", Table131518[Duration])>= 4, 4,IF(SUMIF(Table131518[Type of Care], \"QI\", Table131518[Duration])<= 3, SUMIF(Table131518[Type of Care], \"QI\", Table131518[Duration]), 0))))> 90)","v":false}]
[null,null,"",null,null,null,null,{"$f":"IF( B33 > $D$10+14, SUMIFS($G$13:G33, $D$13:D33,\"Direct/Indirect/Clinical Administration\", $B$13:B33,\">\"&$D$10 + 14) + ((IF(SUMIF(Table131518[Type of Care], \"QI\", Table131518[Duration])>= 4, 4,IF(SUMIF(Table131518[Type of Care], \"QI\", Table131518[Duration])<= 3, SUMIF(Table131518[Type of Care], \"QI\", Table131518[Duration]), 0))))  > 90, SUMIFS($G$13:G33, $D$13:D33,\"Direct/Indirect/Clinical Administration\",  $B$13:B33,\"<=\"&$D$10 + 14)+ ((IF(SUMIF(Table131518[Type of Care], \"QI\", Table131518[Duration])>= 4, 4,IF(SUMIF(Table131518[Type of Care], \"QI\", Table131518[Duration])<= 3, SUMIF(Table131518[Type of Care], \"QI\", Table131518[Duration]), 0))))> 90)","v":false}]
[null,null,"",null,null,null,null,{"$f":"IF( B34 > $D$10+14, SUMIFS($G$13:G34, $D$13:D34,\"Direct/Indirect/Clinical Administration\", $B$13:B34,\">\"&$D$10 + 14) + ((IF(SUMIF(Table131518[Type of Care], \"QI\", Table131518[Duration])>= 4, 4,IF(SUMIF(Table131518[Type of Care], \"QI\", Table131518[Duration])<= 3, SUMIF(Table131518[Type of Care], \"QI\", Table131518[Duration]), 0))))  > 90, SUMIFS($G$13:G34, $D$13:D34,\"Direct/Indirect/Clinical Administration\",  $B$13:B34,\"<=\"&$D$10 + 14)+ ((IF(SUMIF(Table131518[Type of Care], \"QI\", Table131518[Duration])>= 4, 4,IF(SUMIF(Table131518[Type of Care], \"QI\", Table131518[Duration])<= 3, SUMIF(Table131518[Type of Care], \"QI\", Table131518[Duration]), 0))))> 90)","v":false}]
[null,null,{"$f":"IF(B35=\"\", \"\", B35)","v":""},null,null,"Total Contract Hours",{"$f":"(SUMIF(Table131518[Type of Care], \"Direct/Indirect/Clinical Administration\",Table131518[Duration]))","v":0},"CT1"]
[null,null,null,null,null,"Total Included QI Hours",{"$f":"(IF(SUMIF(Table131518[Type of Care], \"QI\", Table131518[Duration])>= 4, 4,IF(SUMIF(Table131518[Type of Care], \"QI\", Table131518[Duration])<= 3, SUMIF(Table131518[Type of Care], \"QI\", Table131518[Duration]), 0)))","v":0},"QI1"]
[null,null,null,null,null,"Total Excluded Hours",{"$f":"G38+G39","v":0},"EX1"]
[null,null,null,null,null,"         Excluded Contract Hours",{"$f":"(SUMIF(Table131518[Type of Care], \"Third Party/Specialist FFS\",Table131518[Duration])) + (SUMIF(Table131518[Type of Care], \"Break (>15 Minutes)\", Table131518[Duration]))","v":0},"EXC1"]
[null,null,null,null,null,"      Excluded QI Hours",{"$f":"(SUMIF(Table131518[Type of Care], \"QI\", Table131518[Duration]) - (IF(SUMIF(Table131518[Type of Care], \"QI\", Table131518[Duration])>= 4, 4,IF(SUMIF(Table131518[Type of Care], \"QI\", Table131518[Duration])<= 3, SUMIF(Table131518[Type of Care], \"QI\", Table131518[Duration]), 0))))","v":0},"EXQI1"]
[null,null,{"$f":"IF(B40=\"\", \"\", B40)","v":""},null,null,"Hours Above 90hr/semi-monthly",{"$f":"  (IF(SUMIFS(Table131518[Duration],Table131518[Date (YYYY-MM-DD)], \">\"&$D$10+14, Table131518[Type of Care], \"Direct/Indirect/Clinical Administration\")>= 90, (SUMIFS(Table131518[Duration],Table131518[Date (YYYY-MM-DD)], \">\"&$D$10+14, Table131518[Type of Care], \"Direct/Indirect/Clinical Administration\")+ (IF(SUMIF(Table131518[Type of Care], \"QI\", Table131518[Duration])>= 4, 4,IF(SUMIF(Table131518[Type of Care], \"QI\", Table131518[Duration])<= 3, SUMIF(Table131518[Type of Care], \"QI\", Table131518[Duration]), 0))) -90))) + (IF(SUMIFS(Table131518[Duration],Table131518[Date (YYYY-MM-DD)], \"<=\"&$D$10+14, Table131518[Type of Care], \"Direct/Indirect/Clinical Administration\")>= 90, (SUMIFS(Table131518[Duration],Table131518[Date (YYYY-MM-DD)], \"<=\"&$D$10+14, Table131518[Type of Care], \"Direct/Indirect/Clinical Administration\")+ (IF(SUMIF(Table131518[Type of Care], \"QI\", Table131518[Duration])>= 4, 4,IF(SUMIF(Table131518[Type of Care], \"QI\", Table131518[Duration])<= 3, SUMIF(Table131518[Type of Care], \"QI\", Table131518[Duration]), 0))) -90)))","v":0},"A901"]
[]
[]
[null,{"$f":"IF(Clinic!C5=\"Jan - Mar\", \"February\", IF(Clinic!C5= \"Apr - June\", \"May\", IF(Clinic!C5=\"July - Sept\", \"August\", IF(Clinic!C5=\" Oct - Dec\", \"November\"))))","v":"February"},{"$f":"Clinic!C6","v":2021},{"$f":"DATE(YEAR(B46),MONTH(DATEVALUE(B43&\"1\")),1)","v":"1900-02-01"},null,null,null,"Month2"]
[]
[null,"Date (YYYY-MM-DD)","Day ","Type of Care","Start Time AM/PM","End Time AM/PM","Duration","FALSE/TRUE"]
[null,null,{"$f":"IF(B46=\"\", \"\", B46)","v":""},null,null,null,null,{"$f":"IF( B46 > $D$43+14, SUMIFS($G$46:G46, $D$46:D46,\"Direct/Indirect/Clinical Administration\", $B$46:B46,\">\"&$D$43 + 14) + ((IF(SUMIF(Table1321619[Type of Care], \"QI\", Table1321619[Duration])>= 4, 4,IF(SUMIF(Table1321619[Type of Care], \"QI\", Table1321619[Duration])<= 3, SUMIF(Table1321619[Type of Care], \"QI\", Table1321619[Duration]), 0))))  > 90, SUMIFS($G$46:G46, $D$46:D46,\"Direct/Indirect/Clinical Administration\",  $B$46:B46,\"<=\"&$D$43 + 14)+ ((IF(SUMIF(Table1321619[Type of Care], \"QI\", Table1321619[Duration])>= 4, 4,IF(SUMIF(Table1321619[Type of Care], \"QI\", Table1321619[Duration])<= 3, SUMIF(Table1321619[Type of Care], \"QI\", Table1321619[Duration]), 0))))> 90)","v":false}]
[null,null,{"$f":"IF(B47=\"\", \"\", B47)","v":""},null,null,null,null,{"$f":"IF( B47 > $D$43+14, SUMIFS($G$46:G47, $D$46:D47,\"Direct/Indirect/Clinical Administration\", $B$46:B47,\">\"&$D$43 + 14) + ((IF(SUMIF(Table1321619[Type of Care], \"QI\", Table1321619[Duration])>= 4, 4,IF(SUMIF(Table1321619[Type of Care], \"QI\", Table1321619[Duration])<= 3, SUMIF(Table1321619[Type of Care], \"QI\", Table1321619[Duration]), 0))))  > 90, SUMIFS($G$46:G47, $D$46:D47,\"Direct/Indirect/Clinical Administration\",  $B$46:B47,\"<=\"&$D$43 + 14)+ ((IF(SUMIF(Table1321619[Type of Care], \"QI\", Table1321619[Duration])>= 4, 4,IF(SUMIF(Table1321619[Type of Care], \"QI\", Table1321619[Duration])<= 3, SUMIF(Table1321619[Type of Care], \"QI\", Table1321619[Duration]), 0))))> 90)","v":false}]
[null,null,"",null,null,null,null,{"$f":"IF( B48 > $D$43+14, SUMIFS($G$46:G48, $D$46:D48,\"Direct/Indirect/Clinical Administration\", $B$46:B48,\">\"&$D$43 + 14) + ((IF(SUMIF(Table1321619[Type of Care], \"QI\", Table1321619[Duration])>= 4, 4,IF(SUMIF(Table1321619[Type of Care], \"QI\", Table1321619[Duration])<= 3, SUMIF(Table1321619[Type of Care], \"QI\", Table1321619[Duration]), 0))))  > 90, SUMIFS($G$46:G48, $D$46:D48,\"Direct/Indirect/Clinical Administration\",  $B$46:B48,\"<=\"&$D$43 + 14)+ ((IF(SUMIF(Table1321619[Type of Care], \"QI\", Table1321619[Duration])>= 4, 4,IF(SUMIF(Table1321619[Type of Care], \"QI\", Table1321619[Duration])<= 3, SUMIF(Table1321619[Type of Care], \"QI\", Table1321619[Duration]), 0))))> 90)","v":false}]
[null,null,"",null,null,null,null,{"$f":"IF( B49 > $D$43+14, SUMIFS($G$46:G49, $D$46:D49,\"Direct/Indirect/Clinical Administration\", $B$46:B49,\">\"&$D$43 + 14) + ((IF(SUMIF(Table1321619[Type of Care], \"QI\", Table1321619[Duration])>= 4, 4,IF(SUMIF(Table1321619[Type of Care], \"QI\", Table1321619[Duration])<= 3, SUMIF(Table1321619[Type of Care], \"QI\", Table1321619[Duration]), 0))))  > 90, SUMIFS($G$46:G49, $D$46:D49,\"Direct/Indirect/Clinical Administration\",  $B$46:B49,\"<=\"&$D$43 + 14)+ ((IF(SUMIF(Table1321619[Type of Care], \"QI\", Table1321619[Duration])>= 4, 4,IF(SUMIF(Table1321619[Type of Care], \"QI\", Table1321619[Duration])<= 3, SUMIF(Table1321619[Type of Care], \"QI\", Table1321619[Duration]), 0))))> 90)","v":false}]
[null,null,"",null,null,null,null,{"$f":"IF( B50 > $D$43+14, SUMIFS($G$46:G50, $D$46:D50,\"Direct/Indirect/Clinical Administration\", $B$46:B50,\">\"&$D$43 + 14) + ((IF(SUMIF(Table1321619[Type of Care], \"QI\", Table1321619[Duration])>= 4, 4,IF(SUMIF(Table1321619[Type of Care], \"QI\", Table1321619[Duration])<= 3, SUMIF(Table1321619[Type of Care], \"QI\", Table1321619[Duration]), 0))))  > 90, SUMIFS($G$46:G50, $D$46:D50,\"Direct/Indirect/Clinical Administration\",  $B$46:B50,\"<=\"&$D$43 + 14)+ ((IF(SUMIF(Table1321619[Type of Care], \"QI\", Table1321619[Duration])>= 4, 4,IF(SUMIF(Table1321619[Type of Care], \"QI\", Table1321619[Duration])<= 3, SUMIF(Table1321619[Type of Care], \"QI\", Table1321619[Duration]), 0))))> 90)","v":false}]
[null,null,"",null,null,null,null,{"$f":"IF( B51 > $D$43+14, SUMIFS($G$46:G51, $D$46:D51,\"Direct/Indirect/Clinical Administration\", $B$46:B51,\">\"&$D$43 + 14) + ((IF(SUMIF(Table1321619[Type of Care], \"QI\", Table1321619[Duration])>= 4, 4,IF(SUMIF(Table1321619[Type of Care], \"QI\", Table1321619[Duration])<= 3, SUMIF(Table1321619[Type of Care], \"QI\", Table1321619[Duration]), 0))))  > 90, SUMIFS($G$46:G51, $D$46:D51,\"Direct/Indirect/Clinical Administration\",  $B$46:B51,\"<=\"&$D$43 + 14)+ ((IF(SUMIF(Table1321619[Type of Care], \"QI\", Table1321619[Duration])>= 4, 4,IF(SUMIF(Table1321619[Type of Care], \"QI\", Table1321619[Duration])<= 3, SUMIF(Table1321619[Type of Care], \"QI\", Table1321619[Duration]), 0))))> 90)","v":false}]
[null,null,"",null,null,null,null,{"$f":"IF( B52 > $D$43+14, SUMIFS($G$46:G52, $D$46:D52,\"Direct/Indirect/Clinical Administration\", $B$46:B52,\">\"&$D$43 + 14) + ((IF(SUMIF(Table1321619[Type of Care], \"QI\", Table1321619[Duration])>= 4, 4,IF(SUMIF(Table1321619[Type of Care], \"QI\", Table1321619[Duration])<= 3, SUMIF(Table1321619[Type of Care], \"QI\", Table1321619[Duration]), 0))))  > 90, SUMIFS($G$46:G52, $D$46:D52,\"Direct/Indirect/Clinical Administration\",  $B$46:B52,\"<=\"&$D$43 + 14)+ ((IF(SUMIF(Table1321619[Type of Care], \"QI\", Table1321619[Duration])>= 4, 4,IF(SUMIF(Table1321619[Type of Care], \"QI\", Table1321619[Duration])<= 3, SUMIF(Table1321619[Type of Care], \"QI\", Table1321619[Duration]), 0))))> 90)","v":false}]
[null,null,"",null,null,null,null,{"$f":"IF( B53 > $D$43+14, SUMIFS($G$46:G53, $D$46:D53,\"Direct/Indirect/Clinical Administration\", $B$46:B53,\">\"&$D$43 + 14) + ((IF(SUMIF(Table1321619[Type of Care], \"QI\", Table1321619[Duration])>= 4, 4,IF(SUMIF(Table1321619[Type of Care], \"QI\", Table1321619[Duration])<= 3, SUMIF(Table1321619[Type of Care], \"QI\", Table1321619[Duration]), 0))))  > 90, SUMIFS($G$46:G53, $D$46:D53,\"Direct/Indirect/Clinical Administration\",  $B$46:B53,\"<=\"&$D$43 + 14)+ ((IF(SUMIF(Table1321619[Type of Care], \"QI\", Table1321619[Duration])>= 4, 4,IF(SUMIF(Table1321619[Type of Care], \"QI\", Table1321619[Duration])<= 3, SUMIF(Table1321619[Type of Care], \"QI\", Table1321619[Duration]), 0))))> 90)","v":false}]
[null,null,"",null,null,null,null,{"$f":"IF( B54 > $D$43+14, SUMIFS($G$46:G54, $D$46:D54,\"Direct/Indirect/Clinical Administration\", $B$46:B54,\">\"&$D$43 + 14) + ((IF(SUMIF(Table1321619[Type of Care], \"QI\", Table1321619[Duration])>= 4, 4,IF(SUMIF(Table1321619[Type of Care], \"QI\", Table1321619[Duration])<= 3, SUMIF(Table1321619[Type of Care], \"QI\", Table1321619[Duration]), 0))))  > 90, SUMIFS($G$46:G54, $D$46:D54,\"Direct/Indirect/Clinical Administration\",  $B$46:B54,\"<=\"&$D$43 + 14)+ ((IF(SUMIF(Table1321619[Type of Care], \"QI\", Table1321619[Duration])>= 4, 4,IF(SUMIF(Table1321619[Type of Care], \"QI\", Table1321619[Duration])<= 3, SUMIF(Table1321619[Type of Care], \"QI\", Table1321619[Duration]), 0))))> 90)","v":false}]
[null,null,"",null,null,null,null,{"$f":"IF( B55 > $D$43+14, SUMIFS($G$46:G55, $D$46:D55,\"Direct/Indirect/Clinical Administration\", $B$46:B55,\">\"&$D$43 + 14) + ((IF(SUMIF(Table1321619[Type of Care], \"QI\", Table1321619[Duration])>= 4, 4,IF(SUMIF(Table1321619[Type of Care], \"QI\", Table1321619[Duration])<= 3, SUMIF(Table1321619[Type of Care], \"QI\", Table1321619[Duration]), 0))))  > 90, SUMIFS($G$46:G55, $D$46:D55,\"Direct/Indirect/Clinical Administration\",  $B$46:B55,\"<=\"&$D$43 + 14)+ ((IF(SUMIF(Table1321619[Type of Care], \"QI\", Table1321619[Duration])>= 4, 4,IF(SUMIF(Table1321619[Type of Care], \"QI\", Table1321619[Duration])<= 3, SUMIF(Table1321619[Type of Care], \"QI\", Table1321619[Duration]), 0))))> 90)","v":false}]
[null,null,"",null,null,null,null,{"$f":"IF( B56 > $D$43+14, SUMIFS($G$46:G56, $D$46:D56,\"Direct/Indirect/Clinical Administration\", $B$46:B56,\">\"&$D$43 + 14) + ((IF(SUMIF(Table1321619[Type of Care], \"QI\", Table1321619[Duration])>= 4, 4,IF(SUMIF(Table1321619[Type of Care], \"QI\", Table1321619[Duration])<= 3, SUMIF(Table1321619[Type of Care], \"QI\", Table1321619[Duration]), 0))))  > 90, SUMIFS($G$46:G56, $D$46:D56,\"Direct/Indirect/Clinical Administration\",  $B$46:B56,\"<=\"&$D$43 + 14)+ ((IF(SUMIF(Table1321619[Type of Care], \"QI\", Table1321619[Duration])>= 4, 4,IF(SUMIF(Table1321619[Type of Care], \"QI\", Table1321619[Duration])<= 3, SUMIF(Table1321619[Type of Care], \"QI\", Table1321619[Duration]), 0))))> 90)","v":false}]
[null,null,{"$f":"IF(B57=\"\", \"\", B57)","v":""},null,null,null,null,{"$f":"IF( B57 > $D$43+14, SUMIFS($G$46:G57, $D$46:D57,\"Direct/Indirect/Clinical Administration\", $B$46:B57,\">\"&$D$43 + 14) + ((IF(SUMIF(Table1321619[Type of Care], \"QI\", Table1321619[Duration])>= 4, 4,IF(SUMIF(Table1321619[Type of Care], \"QI\", Table1321619[Duration])<= 3, SUMIF(Table1321619[Type of Care], \"QI\", Table1321619[Duration]), 0))))  > 90, SUMIFS($G$46:G57, $D$46:D57,\"Direct/Indirect/Clinical Administration\",  $B$46:B57,\"<=\"&$D$43 + 14)+ ((IF(SUMIF(Table1321619[Type of Care], \"QI\", Table1321619[Duration])>= 4, 4,IF(SUMIF(Table1321619[Type of Care], \"QI\", Table1321619[Duration])<= 3, SUMIF(Table1321619[Type of Care], \"QI\", Table1321619[Duration]), 0))))> 90)","v":false}]
[null,null,{"$f":"IF(B58=\"\", \"\", B58)","v":""},null,null,null,null,{"$f":"IF( B58 > $D$43+14, SUMIFS($G$46:G58, $D$46:D58,\"Direct/Indirect/Clinical Administration\", $B$46:B58,\">\"&$D$43 + 14) + ((IF(SUMIF(Table1321619[Type of Care], \"QI\", Table1321619[Duration])>= 4, 4,IF(SUMIF(Table1321619[Type of Care], \"QI\", Table1321619[Duration])<= 3, SUMIF(Table1321619[Type of Care], \"QI\", Table1321619[Duration]), 0))))  > 90, SUMIFS($G$46:G58, $D$46:D58,\"Direct/Indirect/Clinical Administration\",  $B$46:B58,\"<=\"&$D$43 + 14)+ ((IF(SUMIF(Table1321619[Type of Care], \"QI\", Table1321619[Duration])>= 4, 4,IF(SUMIF(Table1321619[Type of Care], \"QI\", Table1321619[Duration])<= 3, SUMIF(Table1321619[Type of Care], \"QI\", Table1321619[Duration]), 0))))> 90)","v":false}]
[null,null,"",null,null,null,null,{"$f":"IF( B59 > $D$43+14, SUMIFS($G$46:G59, $D$46:D59,\"Direct/Indirect/Clinical Administration\", $B$46:B59,\">\"&$D$43 + 14) + ((IF(SUMIF(Table1321619[Type of Care], \"QI\", Table1321619[Duration])>= 4, 4,IF(SUMIF(Table1321619[Type of Care], \"QI\", Table1321619[Duration])<= 3, SUMIF(Table1321619[Type of Care], \"QI\", Table1321619[Duration]), 0))))  > 90, SUMIFS($G$46:G59, $D$46:D59,\"Direct/Indirect/Clinical Administration\",  $B$46:B59,\"<=\"&$D$43 + 14)+ ((IF(SUMIF(Table1321619[Type of Care], \"QI\", Table1321619[Duration])>= 4, 4,IF(SUMIF(Table1321619[Type of Care], \"QI\", Table1321619[Duration])<= 3, SUMIF(Table1321619[Type of Care], \"QI\", Table1321619[Duration]), 0))))> 90)","v":false}]
[null,null,"",null,null,null,null,{"$f":"IF( B60 > $D$43+14, SUMIFS($G$46:G60, $D$46:D60,\"Direct/Indirect/Clinical Administration\", $B$46:B60,\">\"&$D$43 + 14) + ((IF(SUMIF(Table1321619[Type of Care], \"QI\", Table1321619[Duration])>= 4, 4,IF(SUMIF(Table1321619[Type of Care], \"QI\", Table1321619[Duration])<= 3, SUMIF(Table1321619[Type of Care], \"QI\", Table1321619[Duration]), 0))))  > 90, SUMIFS($G$46:G60, $D$46:D60,\"Direct/Indirect/Clinical Administration\",  $B$46:B60,\"<=\"&$D$43 + 14)+ ((IF(SUMIF(Table1321619[Type of Care], \"QI\", Table1321619[Duration])>= 4, 4,IF(SUMIF(Table1321619[Type of Care], \"QI\", Table1321619[Duration])<= 3, SUMIF(Table1321619[Type of Care], \"QI\", Table1321619[Duration]), 0))))> 90)","v":false}]
[null,null,"",null,null,null,null,{"$f":"IF( B61 > $D$43+14, SUMIFS($G$46:G61, $D$46:D61,\"Direct/Indirect/Clinical Administration\", $B$46:B61,\">\"&$D$43 + 14) + ((IF(SUMIF(Table1321619[Type of Care], \"QI\", Table1321619[Duration])>= 4, 4,IF(SUMIF(Table1321619[Type of Care], \"QI\", Table1321619[Duration])<= 3, SUMIF(Table1321619[Type of Care], \"QI\", Table1321619[Duration]), 0))))  > 90, SUMIFS($G$46:G61, $D$46:D61,\"Direct/Indirect/Clinical Administration\",  $B$46:B61,\"<=\"&$D$43 + 14)+ ((IF(SUMIF(Table1321619[Type of Care], \"QI\", Table1321619[Duration])>= 4, 4,IF(SUMIF(Table1321619[Type of Care], \"QI\", Table1321619[Duration])<= 3, SUMIF(Table1321619[Type of Care], \"QI\", Table1321619[Duration]), 0))))> 90)","v":false}]
[null,null,"",null,null,null,null,{"$f":"IF( B62 > $D$43+14, SUMIFS($G$46:G62, $D$46:D62,\"Direct/Indirect/Clinical Administration\", $B$46:B62,\">\"&$D$43 + 14) + ((IF(SUMIF(Table1321619[Type of Care], \"QI\", Table1321619[Duration])>= 4, 4,IF(SUMIF(Table1321619[Type of Care], \"QI\", Table1321619[Duration])<= 3, SUMIF(Table1321619[Type of Care], \"QI\", Table1321619[Duration]), 0))))  > 90, SUMIFS($G$46:G62, $D$46:D62,\"Direct/Indirect/Clinical Administration\",  $B$46:B62,\"<=\"&$D$43 + 14)+ ((IF(SUMIF(Table1321619[Type of Care], \"QI\", Table1321619[Duration])>= 4, 4,IF(SUMIF(Table1321619[Type of Care], \"QI\", Table1321619[Duration])<= 3, SUMIF(Table1321619[Type of Care], \"QI\", Table1321619[Duration]), 0))))> 90)","v":false}]
[null,null,"",null,null,null,null,{"$f":"IF( B63 > $D$43+14, SUMIFS($G$46:G63, $D$46:D63,\"Direct/Indirect/Clinical Administration\", $B$46:B63,\">\"&$D$43 + 14) + ((IF(SUMIF(Table1321619[Type of Care], \"QI\", Table1321619[Duration])>= 4, 4,IF(SUMIF(Table1321619[Type of Care], \"QI\", Table1321619[Duration])<= 3, SUMIF(Table1321619[Type of Care], \"QI\", Table1321619[Duration]), 0))))  > 90, SUMIFS($G$46:G63, $D$46:D63,\"Direct/Indirect/Clinical Administration\",  $B$46:B63,\"<=\"&$D$43 + 14)+ ((IF(SUMIF(Table1321619[Type of Care], \"QI\", Table1321619[Duration])>= 4, 4,IF(SUMIF(Table1321619[Type of Care], \"QI\", Table1321619[Duration])<= 3, SUMIF(Table1321619[Type of Care], \"QI\", Table1321619[Duration]), 0))))> 90)","v":false}]
[null,null,{"$f":"IF(B64=\"\", \"\", B64)","v":""},null,null,null,null,{"$f":"IF( B64 > $D$43+14, SUMIFS($G$46:G64, $D$46:D64,\"Direct/Indirect/Clinical Administration\", $B$46:B64,\">\"&$D$43 + 14) + ((IF(SUMIF(Table1321619[Type of Care], \"QI\", Table1321619[Duration])>= 4, 4,IF(SUMIF(Table1321619[Type of Care], \"QI\", Table1321619[Duration])<= 3, SUMIF(Table1321619[Type of Care], \"QI\", Table1321619[Duration]), 0))))  > 90, SUMIFS($G$46:G64, $D$46:D64,\"Direct/Indirect/Clinical Administration\",  $B$46:B64,\"<=\"&$D$43 + 14)+ ((IF(SUMIF(Table1321619[Type of Care], \"QI\", Table1321619[Duration])>= 4, 4,IF(SUMIF(Table1321619[Type of Care], \"QI\", Table1321619[Duration])<= 3, SUMIF(Table1321619[Type of Care], \"QI\", Table1321619[Duration]), 0))))> 90)","v":false}]
[null,null,{"$f":"IF(B65=\"\", \"\", B65)","v":""},null,null,null,null,{"$f":"IF( B65 > $D$43+14, SUMIFS($G$46:G65, $D$46:D65,\"Direct/Indirect/Clinical Administration\", $B$46:B65,\">\"&$D$43 + 14) + ((IF(SUMIF(Table1321619[Type of Care], \"QI\", Table1321619[Duration])>= 4, 4,IF(SUMIF(Table1321619[Type of Care], \"QI\", Table1321619[Duration])<= 3, SUMIF(Table1321619[Type of Care], \"QI\", Table1321619[Duration]), 0))))  > 90, SUMIFS($G$46:G65, $D$46:D65,\"Direct/Indirect/Clinical Administration\",  $B$46:B65,\"<=\"&$D$43 + 14)+ ((IF(SUMIF(Table1321619[Type of Care], \"QI\", Table1321619[Duration])>= 4, 4,IF(SUMIF(Table1321619[Type of Care], \"QI\", Table1321619[Duration])<= 3, SUMIF(Table1321619[Type of Care], \"QI\", Table1321619[Duration]), 0))))> 90)","v":false}]
[null,null,{"$f":"IF(B66=\"\", \"\", B66)","v":""},null,null,null,null,{"$f":"IF( B66 > $D$43+14, SUMIFS($G$46:G66, $D$46:D66,\"Direct/Indirect/Clinical Administration\", $B$46:B66,\">\"&$D$43 + 14) + ((IF(SUMIF(Table1321619[Type of Care], \"QI\", Table1321619[Duration])>= 4, 4,IF(SUMIF(Table1321619[Type of Care], \"QI\", Table1321619[Duration])<= 3, SUMIF(Table1321619[Type of Care], \"QI\", Table1321619[Duration]), 0))))  > 90, SUMIFS($G$46:G66, $D$46:D66,\"Direct/Indirect/Clinical Administration\",  $B$46:B66,\"<=\"&$D$43 + 14)+ ((IF(SUMIF(Table1321619[Type of Care], \"QI\", Table1321619[Duration])>= 4, 4,IF(SUMIF(Table1321619[Type of Care], \"QI\", Table1321619[Duration])<= 3, SUMIF(Table1321619[Type of Care], \"QI\", Table1321619[Duration]), 0))))> 90)","v":false}]
[null,null,{"$f":"IF(B67=\"\", \"\", B67)","v":""},null,null,null,null,{"$f":"IF( B67 > $D$43+14, SUMIFS($G$46:G67, $D$46:D67,\"Direct/Indirect/Clinical Administration\", $B$46:B67,\">\"&$D$43 + 14) + ((IF(SUMIF(Table1321619[Type of Care], \"QI\", Table1321619[Duration])>= 4, 4,IF(SUMIF(Table1321619[Type of Care], \"QI\", Table1321619[Duration])<= 3, SUMIF(Table1321619[Type of Care], \"QI\", Table1321619[Duration]), 0))))  > 90, SUMIFS($G$46:G67, $D$46:D67,\"Direct/Indirect/Clinical Administration\",  $B$46:B67,\"<=\"&$D$43 + 14)+ ((IF(SUMIF(Table1321619[Type of Care], \"QI\", Table1321619[Duration])>= 4, 4,IF(SUMIF(Table1321619[Type of Care], \"QI\", Table1321619[Duration])<= 3, SUMIF(Table1321619[Type of Care], \"QI\", Table1321619[Duration]), 0))))> 90)","v":false}]
[null,null,"",null,null,null,null,{"$f":"IF( B68 > $D$43+14, SUMIFS($G$46:G68, $D$46:D68,\"Direct/Indirect/Clinical Administration\", $B$46:B68,\">\"&$D$43 + 14) + ((IF(SUMIF(Table1321619[Type of Care], \"QI\", Table1321619[Duration])>= 4, 4,IF(SUMIF(Table1321619[Type of Care], \"QI\", Table1321619[Duration])<= 3, SUMIF(Table1321619[Type of Care], \"QI\", Table1321619[Duration]), 0))))  > 90, SUMIFS($G$46:G68, $D$46:D68,\"Direct/Indirect/Clinical Administration\",  $B$46:B68,\"<=\"&$D$43 + 14)+ ((IF(SUMIF(Table1321619[Type of Care], \"QI\", Table1321619[Duration])>= 4, 4,IF(SUMIF(Table1321619[Type of Care], \"QI\", Table1321619[Duration])<= 3, SUMIF(Table1321619[Type of Care], \"QI\", Table1321619[Duration]), 0))))> 90)","v":false}]
[null,null,"",null,null,null,null,{"$f":"IF( B69 > $D$43+14, SUMIFS($G$46:G69, $D$46:D69,\"Direct/Indirect/Clinical Administration\", $B$46:B69,\">\"&$D$43 + 14) + ((IF(SUMIF(Table1321619[Type of Care], \"QI\", Table1321619[Duration])>= 4, 4,IF(SUMIF(Table1321619[Type of Care], \"QI\", Table1321619[Duration])<= 3, SUMIF(Table1321619[Type of Care], \"QI\", Table1321619[Duration]), 0))))  > 90, SUMIFS($G$46:G69, $D$46:D69,\"Direct/Indirect/Clinical Administration\",  $B$46:B69,\"<=\"&$D$43 + 14)+ ((IF(SUMIF(Table1321619[Type of Care], \"QI\", Table1321619[Duration])>= 4, 4,IF(SUMIF(Table1321619[Type of Care], \"QI\", Table1321619[Duration])<= 3, SUMIF(Table1321619[Type of Care], \"QI\", Table1321619[Duration]), 0))))> 90)","v":false}]
[null,null,{"$f":"IF(B70=\"\", \"\", B70)","v":""},null,null,null,null,{"$f":"IF( B70 > $D$43+14, SUMIFS($G$46:G70, $D$46:D70,\"Direct/Indirect/Clinical Administration\", $B$46:B70,\">\"&$D$43 + 14) + ((IF(SUMIF(Table1321619[Type of Care], \"QI\", Table1321619[Duration])>= 4, 4,IF(SUMIF(Table1321619[Type of Care], \"QI\", Table1321619[Duration])<= 3, SUMIF(Table1321619[Type of Care], \"QI\", Table1321619[Duration]), 0))))  > 90, SUMIFS($G$46:G70, $D$46:D70,\"Direct/Indirect/Clinical Administration\",  $B$46:B70,\"<=\"&$D$43 + 14)+ ((IF(SUMIF(Table1321619[Type of Care], \"QI\", Table1321619[Duration])>= 4, 4,IF(SUMIF(Table1321619[Type of Care], \"QI\", Table1321619[Duration])<= 3, SUMIF(Table1321619[Type of Care], \"QI\", Table1321619[Duration]), 0))))> 90)","v":false}]
[null,null,{"$f":"IF(B71=\"\", \"\", B71)","v":""},null,null,null,null,{"$f":"IF( B71 > $D$43+14, SUMIFS($G$46:G71, $D$46:D71,\"Direct/Indirect/Clinical Administration\", $B$46:B71,\">\"&$D$43 + 14) + ((IF(SUMIF(Table1321619[Type of Care], \"QI\", Table1321619[Duration])>= 4, 4,IF(SUMIF(Table1321619[Type of Care], \"QI\", Table1321619[Duration])<= 3, SUMIF(Table1321619[Type of Care], \"QI\", Table1321619[Duration]), 0))))  > 90, SUMIFS($G$46:G71, $D$46:D71,\"Direct/Indirect/Clinical Administration\",  $B$46:B71,\"<=\"&$D$43 + 14)+ ((IF(SUMIF(Table1321619[Type of Care], \"QI\", Table1321619[Duration])>= 4, 4,IF(SUMIF(Table1321619[Type of Care], \"QI\", Table1321619[Duration])<= 3, SUMIF(Table1321619[Type of Care], \"QI\", Table1321619[Duration]), 0))))> 90)","v":false}]
[null,null,{"$f":"IF(B72=\"\", \"\", B72)","v":""},null,null,null,null,{"$f":"IF( B72 > $D$43+14, SUMIFS($G$46:G72, $D$46:D72,\"Direct/Indirect/Clinical Administration\", $B$46:B72,\">\"&$D$43 + 14) + ((IF(SUMIF(Table1321619[Type of Care], \"QI\", Table1321619[Duration])>= 4, 4,IF(SUMIF(Table1321619[Type of Care], \"QI\", Table1321619[Duration])<= 3, SUMIF(Table1321619[Type of Care], \"QI\", Table1321619[Duration]), 0))))  > 90, SUMIFS($G$46:G72, $D$46:D72,\"Direct/Indirect/Clinical Administration\",  $B$46:B72,\"<=\"&$D$43 + 14)+ ((IF(SUMIF(Table1321619[Type of Care], \"QI\", Table1321619[Duration])>= 4, 4,IF(SUMIF(Table1321619[Type of Care], \"QI\", Table1321619[Duration])<= 3, SUMIF(Table1321619[Type of Care], \"QI\", Table1321619[Duration]), 0))))> 90)","v":false}]
[null,null,{"$f":"IF(B73=\"\", \"\", B73)","v":""},null,null,null,null,{"$f":"IF( B73 > $D$43+14, SUMIFS($G$46:G73, $D$46:D73,\"Direct/Indirect/Clinical Administration\", $B$46:B73,\">\"&$D$43 + 14) + ((IF(SUMIF(Table1321619[Type of Care], \"QI\", Table1321619[Duration])>= 4, 4,IF(SUMIF(Table1321619[Type of Care], \"QI\", Table1321619[Duration])<= 3, SUMIF(Table1321619[Type of Care], \"QI\", Table1321619[Duration]), 0))))  > 90, SUMIFS($G$46:G73, $D$46:D73,\"Direct/Indirect/Clinical Administration\",  $B$46:B73,\"<=\"&$D$43 + 14)+ ((IF(SUMIF(Table1321619[Type of Care], \"QI\", Table1321619[Duration])>= 4, 4,IF(SUMIF(Table1321619[Type of Care], \"QI\", Table1321619[Duration])<= 3, SUMIF(Table1321619[Type of Care], \"QI\", Table1321619[Duration]), 0))))> 90)","v":false}]
[null,null,{"$f":"IF(B74=\"\", \"\", B74)","v":""},null,null,null,null,{"$f":"IF( B74 > $D$43+14, SUMIFS($G$46:G74, $D$46:D74,\"Direct/Indirect/Clinical Administration\", $B$46:B74,\">\"&$D$43 + 14) + ((IF(SUMIF(Table1321619[Type of Care], \"QI\", Table1321619[Duration])>= 4, 4,IF(SUMIF(Table1321619[Type of Care], \"QI\", Table1321619[Duration])<= 3, SUMIF(Table1321619[Type of Care], \"QI\", Table1321619[Duration]), 0))))  > 90, SUMIFS($G$46:G74, $D$46:D74,\"Direct/Indirect/Clinical Administration\",  $B$46:B74,\"<=\"&$D$43 + 14)+ ((IF(SUMIF(Table1321619[Type of Care], \"QI\", Table1321619[Duration])>= 4, 4,IF(SUMIF(Table1321619[Type of Care], \"QI\", Table1321619[Duration])<= 3, SUMIF(Table1321619[Type of Care], \"QI\", Table1321619[Duration]), 0))))> 90)","v":false}]
[null,null,{"$f":"IF(B75=\"\", \"\", B75)","v":""},null,null,"Total Contract Hours",{"$f":"(SUMIF(Table1321619[Type of Care], \"Direct/Indirect/Clinical Administration\",Table1321619[Duration])) + (SUMIF(Table1321619[Type of Care], \"Correction Hours\",Table1321619[Duration]))","v":0},"CT2"]
[null,null,null,null,null,"Total Included QI Hours",{"$f":"(IF(SUMIF(Table1321619[Type of Care], \"QI\", Table1321619[Duration])>= 4, 4,IF(SUMIF(Table1321619[Type of Care], \"QI\", Table1321619[Duration])<= 3, SUMIF(Table1321619[Type of Care], \"QI\", Table1321619[Duration]), 0)))","v":0},"QI2"]
[null,null,null,null,null,"Total Excluded Hours",{"$f":"G78+G79","v":0},"EX2"]
[null,null,null,null,null,"         Excluded Contract Hours",{"$f":"(SUMIF(Table1321619[Type of Care], \"Third Party/Specialist FFS\",Table1321619[Duration])) + (SUMIF(Table1321619[Type of Care], \"Break (>15 Minutes)\", Table1321619[Duration]))","v":0},"EXC2"]
[null,null,null,null,null,"      Excluded QI Hours",{"$f":"(SUMIF(Table1321619[Type of Care], \"QI\", Table1321619[Duration]) - (IF(SUMIF(Table1321619[Type of Care], \"QI\", Table1321619[Duration])>= 4, 4,IF(SUMIF(Table1321619[Type of Care], \"QI\", Table1321619[Duration])<= 3, SUMIF(Table1321619[Type of Care], \"QI\", Table1321619[Duration]), 0))))","v":0},"EXQI2"]
[null,null,{"$f":"IF(B80=\"\", \"\", B80)","v":""},null,null,"Hours Above 90hr/semi-monthly",{"$f":"  (IF(SUMIFS(Table1321619[Duration],Table1321619[Date (YYYY-MM-DD)], \">\"&$D$43+14, Table1321619[Type of Care], \"Direct/Indirect/Clinical Administration\")>= 90, (SUMIFS(Table1321619[Duration],Table1321619[Date (YYYY-MM-DD)], \">\"&$D$43+14, Table1321619[Type of Care], \"Direct/Indirect/Clinical Administration\")+ (IF(SUMIF(Table1321619[Type of Care], \"QI\", Table1321619[Duration])>= 4, 4,IF(SUMIF(Table1321619[Type of Care], \"QI\", Table1321619[Duration])<= 3, SUMIF(Table1321619[Type of Care], \"QI\", Table1321619[Duration]), 0))) -90))) + (IF(SUMIFS(Table1321619[Duration],Table1321619[Date (YYYY-MM-DD)], \"<=\"&$D$43+14, Table1321619[Type of Care], \"Direct/Indirect/Clinical Administration\")>= 90, (SUMIFS(Table1321619[Duration],Table1321619[Date (YYYY-MM-DD)], \"<=\"&$D$43+14, Table1321619[Type of Care], \"Direct/Indirect/Clinical Administration\")+ (IF(SUMIF(Table1321619[Type of Care], \"QI\", Table1321619[Duration])>= 4, 4,IF(SUMIF(Table1321619[Type of Care], \"QI\", Table1321619[Duration])<= 3, SUMIF(Table1321619[Type of Care], \"QI\", Table1321619[Duration]), 0))) -90)))","v":0},"A902"]
[]
[]
[null,{"$f":"IF(Clinic!C5=\"Jan - Mar\", \"March\", IF(Clinic!C5= \"Apr - June\", \"June\", IF(Clinic!C5=\"July - Sept\", \"September\", IF(Clinic!C5=\" Oct - Dec\", \"December\"))))","v":"March"},{"$f":"Clinic!C6","v":2021},{"$f":"DATE(YEAR(B86),MONTH(DATEVALUE(B83&\"1\")),1)","v":"1900-03-01"},null,null,null,"Month3"]
[]
[null,"Date (YYYY-MM-DD)","Day ","Type of Care","Start Time AM/PM","End Time AM/PM","Duration ","FALSE/TRUE"]
[null,null,{"$f":"IF(B86=\"\", \"\", B86)","v":""},null,null,null,null,{"$f":"IF( B86 > $D$83+14, SUMIFS($I$86:I86, $D$86:D86,\"Direct/Indirect/Clinical Administration\", $B$86:B86,\">\"&$D$83 + 14) + ((IF(SUMIF(Table13261720[Type of Care], \"QI\", Table13261720[[Duration ]])>= 4, 4,IF(SUMIF(Table13261720[Type of Care], \"QI\", Table13261720[[Duration ]])<= 3, SUMIF(Table13261720[Type of Care], \"QI\", Table13261720[[Duration ]]), 0))))  > 90, SUMIFS($I$86:I86, $D$86:D86,\"Direct/Indirect/Clinical Administration\",  $B$86:B86,\"<=\"&$D$83 + 14)+ ((IF(SUMIF(Table13261720[Type of Care], \"QI\", Table13261720[[Duration ]])>= 4, 4,IF(SUMIF(Table13261720[Type of Care], \"QI\", Table13261720[[Duration ]])<= 3, SUMIF(Table13261720[Type of Care], \"QI\", Table13261720[[Duration ]]), 0))))> 90)","v":false}]
[null,null,{"$f":"IF(B87=\"\", \"\", B87)","v":""},null,null,null,null,{"$f":"IF( B87 > $D$83+14, SUMIFS($G$86:G87, $D$86:D87,\"Direct/Indirect/Clinical Administration\", $B$86:B87,\">\"&$D$83 + 14) + ((IF(SUMIF(Table13261720[Type of Care], \"QI\", Table13261720[[Duration ]])>= 4, 4,IF(SUMIF(Table13261720[Type of Care], \"QI\", Table13261720[[Duration ]])<= 3, SUMIF(Table13261720[Type of Care], \"QI\", Table13261720[[Duration ]]), 0))))  > 90, SUMIFS($G$86:G87, $D$86:D87,\"Direct/Indirect/Clinical Administration\",  $B$86:B87,\"<=\"&$D$83 + 14)+ ((IF(SUMIF(Table13261720[Type of Care], \"QI\", Table13261720[[Duration ]])>= 4, 4,IF(SUMIF(Table13261720[Type of Care], \"QI\", Table13261720[[Duration ]])<= 3, SUMIF(Table13261720[Type of Care], \"QI\", Table13261720[[Duration ]]), 0))))> 90)","v":false}]
[null,null,"",null,null,null,null,{"$f":"IF( B88 > $D$83+14, SUMIFS($G$86:G88, $D$86:D88,\"Direct/Indirect/Clinical Administration\", $B$86:B88,\">\"&$D$83 + 14) + ((IF(SUMIF(Table13261720[Type of Care], \"QI\", Table13261720[[Duration ]])>= 4, 4,IF(SUMIF(Table13261720[Type of Care], \"QI\", Table13261720[[Duration ]])<= 3, SUMIF(Table13261720[Type of Care], \"QI\", Table13261720[[Duration ]]), 0))))  > 90, SUMIFS($G$86:G88, $D$86:D88,\"Direct/Indirect/Clinical Administration\",  $B$86:B88,\"<=\"&$D$83 + 14)+ ((IF(SUMIF(Table13261720[Type of Care], \"QI\", Table13261720[[Duration ]])>= 4, 4,IF(SUMIF(Table13261720[Type of Care], \"QI\", Table13261720[[Duration ]])<= 3, SUMIF(Table13261720[Type of Care], \"QI\", Table13261720[[Duration ]]), 0))))> 90)","v":false}]
[null,null,"",null,null,null,null,{"$f":"IF( B89 > $D$83+14, SUMIFS($G$86:G89, $D$86:D89,\"Direct/Indirect/Clinical Administration\", $B$86:B89,\">\"&$D$83 + 14) + ((IF(SUMIF(Table13261720[Type of Care], \"QI\", Table13261720[[Duration ]])>= 4, 4,IF(SUMIF(Table13261720[Type of Care], \"QI\", Table13261720[[Duration ]])<= 3, SUMIF(Table13261720[Type of Care], \"QI\", Table13261720[[Duration ]]), 0))))  > 90, SUMIFS($G$86:G89, $D$86:D89,\"Direct/Indirect/Clinical Administration\",  $B$86:B89,\"<=\"&$D$83 + 14)+ ((IF(SUMIF(Table13261720[Type of Care], \"QI\", Table13261720[[Duration ]])>= 4, 4,IF(SUMIF(Table13261720[Type of Care], \"QI\", Table13261720[[Duration ]])<= 3, SUMIF(Table13261720[Type of Care], \"QI\", Table13261720[[Duration ]]), 0))))> 90)","v":false}]
[null,null,"",null,null,null,null,{"$f":"IF( B90 > $D$83+14, SUMIFS($G$86:G90, $D$86:D90,\"Direct/Indirect/Clinical Administration\", $B$86:B90,\">\"&$D$83 + 14) + ((IF(SUMIF(Table13261720[Type of Care], \"QI\", Table13261720[[Duration ]])>= 4, 4,IF(SUMIF(Table13261720[Type of Care], \"QI\", Table13261720[[Duration ]])<= 3, SUMIF(Table13261720[Type of Care], \"QI\", Table13261720[[Duration ]]), 0))))  > 90, SUMIFS($G$86:G90, $D$86:D90,\"Direct/Indirect/Clinical Administration\",  $B$86:B90,\"<=\"&$D$83 + 14)+ ((IF(SUMIF(Table13261720[Type of Care], \"QI\", Table13261720[[Duration ]])>= 4, 4,IF(SUMIF(Table13261720[Type of Care], \"QI\", Table13261720[[Duration ]])<= 3, SUMIF(Table13261720[Type of Care], \"QI\", Table13261720[[Duration ]]), 0))))> 90)","v":false}]
[null,null,"",null,null,null,null,{"$f":"IF( B91 > $D$83+14, SUMIFS($G$86:G91, $D$86:D91,\"Direct/Indirect/Clinical Administration\", $B$86:B91,\">\"&$D$83 + 14) + ((IF(SUMIF(Table13261720[Type of Care], \"QI\", Table13261720[[Duration ]])>= 4, 4,IF(SUMIF(Table13261720[Type of Care], \"QI\", Table13261720[[Duration ]])<= 3, SUMIF(Table13261720[Type of Care], \"QI\", Table13261720[[Duration ]]), 0))))  > 90, SUMIFS($G$86:G91, $D$86:D91,\"Direct/Indirect/Clinical Administration\",  $B$86:B91,\"<=\"&$D$83 + 14)+ ((IF(SUMIF(Table13261720[Type of Care], \"QI\", Table13261720[[Duration ]])>= 4, 4,IF(SUMIF(Table13261720[Type of Care], \"QI\", Table13261720[[Duration ]])<= 3, SUMIF(Table13261720[Type of Care], \"QI\", Table13261720[[Duration ]]), 0))))> 90)","v":false}]
[null,null,"",null,null,null,null,{"$f":"IF( B92 > $D$83+14, SUMIFS($G$86:G92, $D$86:D92,\"Direct/Indirect/Clinical Administration\", $B$86:B92,\">\"&$D$83 + 14) + ((IF(SUMIF(Table13261720[Type of Care], \"QI\", Table13261720[[Duration ]])>= 4, 4,IF(SUMIF(Table13261720[Type of Care], \"QI\", Table13261720[[Duration ]])<= 3, SUMIF(Table13261720[Type of Care], \"QI\", Table13261720[[Duration ]]), 0))))  > 90, SUMIFS($G$86:G92, $D$86:D92,\"Direct/Indirect/Clinical Administration\",  $B$86:B92,\"<=\"&$D$83 + 14)+ ((IF(SUMIF(Table13261720[Type of Care], \"QI\", Table13261720[[Duration ]])>= 4, 4,IF(SUMIF(Table13261720[Type of Care], \"QI\", Table13261720[[Duration ]])<= 3, SUMIF(Table13261720[Type of Care], \"QI\", Table13261720[[Duration ]]), 0))))> 90)","v":false}]
[null,null,"",null,null,null,null,{"$f":"IF( B93 > $D$83+14, SUMIFS($G$86:G93, $D$86:D93,\"Direct/Indirect/Clinical Administration\", $B$86:B93,\">\"&$D$83 + 14) + ((IF(SUMIF(Table13261720[Type of Care], \"QI\", Table13261720[[Duration ]])>= 4, 4,IF(SUMIF(Table13261720[Type of Care], \"QI\", Table13261720[[Duration ]])<= 3, SUMIF(Table13261720[Type of Care], \"QI\", Table13261720[[Duration ]]), 0))))  > 90, SUMIFS($G$86:G93, $D$86:D93,\"Direct/Indirect/Clinical Administration\",  $B$86:B93,\"<=\"&$D$83 + 14)+ ((IF(SUMIF(Table13261720[Type of Care], \"QI\", Table13261720[[Duration ]])>= 4, 4,IF(SUMIF(Table13261720[Type of Care], \"QI\", Table13261720[[Duration ]])<= 3, SUMIF(Table13261720[Type of Care], \"QI\", Table13261720[[Duration ]]), 0))))> 90)","v":false}]
[null,null,"",null,null,null,null,{"$f":"IF( B94 > $D$83+14, SUMIFS($G$86:G94, $D$86:D94,\"Direct/Indirect/Clinical Administration\", $B$86:B94,\">\"&$D$83 + 14) + ((IF(SUMIF(Table13261720[Type of Care], \"QI\", Table13261720[[Duration ]])>= 4, 4,IF(SUMIF(Table13261720[Type of Care], \"QI\", Table13261720[[Duration ]])<= 3, SUMIF(Table13261720[Type of Care], \"QI\", Table13261720[[Duration ]]), 0))))  > 90, SUMIFS($G$86:G94, $D$86:D94,\"Direct/Indirect/Clinical Administration\",  $B$86:B94,\"<=\"&$D$83 + 14)+ ((IF(SUMIF(Table13261720[Type of Care], \"QI\", Table13261720[[Duration ]])>= 4, 4,IF(SUMIF(Table13261720[Type of Care], \"QI\", Table13261720[[Duration ]])<= 3, SUMIF(Table13261720[Type of Care], \"QI\", Table13261720[[Duration ]]), 0))))> 90)","v":false}]
[null,null,"",null,null,null,null,{"$f":"IF( B95 > $D$83+14, SUMIFS($G$86:G95, $D$86:D95,\"Direct/Indirect/Clinical Administration\", $B$86:B95,\">\"&$D$83 + 14) + ((IF(SUMIF(Table13261720[Type of Care], \"QI\", Table13261720[[Duration ]])>= 4, 4,IF(SUMIF(Table13261720[Type of Care], \"QI\", Table13261720[[Duration ]])<= 3, SUMIF(Table13261720[Type of Care], \"QI\", Table13261720[[Duration ]]), 0))))  > 90, SUMIFS($G$86:G95, $D$86:D95,\"Direct/Indirect/Clinical Administration\",  $B$86:B95,\"<=\"&$D$83 + 14)+ ((IF(SUMIF(Table13261720[Type of Care], \"QI\", Table13261720[[Duration ]])>= 4, 4,IF(SUMIF(Table13261720[Type of Care], \"QI\", Table13261720[[Duration ]])<= 3, SUMIF(Table13261720[Type of Care], \"QI\", Table13261720[[Duration ]]), 0))))> 90)","v":false}]
[null,null,"",null,null,null,null,{"$f":"IF( B96 > $D$83+14, SUMIFS($G$86:G96, $D$86:D96,\"Direct/Indirect/Clinical Administration\", $B$86:B96,\">\"&$D$83 + 14) + ((IF(SUMIF(Table13261720[Type of Care], \"QI\", Table13261720[[Duration ]])>= 4, 4,IF(SUMIF(Table13261720[Type of Care], \"QI\", Table13261720[[Duration ]])<= 3, SUMIF(Table13261720[Type of Care], \"QI\", Table13261720[[Duration ]]), 0))))  > 90, SUMIFS($G$86:G96, $D$86:D96,\"Direct/Indirect/Clinical Administration\",  $B$86:B96,\"<=\"&$D$83 + 14)+ ((IF(SUMIF(Table13261720[Type of Care], \"QI\", Table13261720[[Duration ]])>= 4, 4,IF(SUMIF(Table13261720[Type of Care], \"QI\", Table13261720[[Duration ]])<= 3, SUMIF(Table13261720[Type of Care], \"QI\", Table13261720[[Duration ]]), 0))))> 90)","v":false}]
[null,null,{"$f":"IF(B97=\"\", \"\", B97)","v":""},null,null,null,null,{"$f":"IF( B97 > $D$83+14, SUMIFS($G$86:G97, $D$86:D97,\"Direct/Indirect/Clinical Administration\", $B$86:B97,\">\"&$D$83 + 14) + ((IF(SUMIF(Table13261720[Type of Care], \"QI\", Table13261720[[Duration ]])>= 4, 4,IF(SUMIF(Table13261720[Type of Care], \"QI\", Table13261720[[Duration ]])<= 3, SUMIF(Table13261720[Type of Care], \"QI\", Table13261720[[Duration ]]), 0))))  > 90, SUMIFS($G$86:G97, $D$86:D97,\"Direct/Indirect/Clinical Administration\",  $B$86:B97,\"<=\"&$D$83 + 14)+ ((IF(SUMIF(Table13261720[Type of Care], \"QI\", Table13261720[[Duration ]])>= 4, 4,IF(SUMIF(Table13261720[Type of Care], \"QI\", Table13261720[[Duration ]])<= 3, SUMIF(Table13261720[Type of Care], \"QI\", Table13261720[[Duration ]]), 0))))> 90)","v":false}]
[null,null,{"$f":"IF(B98=\"\", \"\", B98)","v":""},null,null,null,null,{"$f":"IF( B98 > $D$83+14, SUMIFS($G$86:G98, $D$86:D98,\"Direct/Indirect/Clinical Administration\", $B$86:B98,\">\"&$D$83 + 14) + ((IF(SUMIF(Table13261720[Type of Care], \"QI\", Table13261720[[Duration ]])>= 4, 4,IF(SUMIF(Table13261720[Type of Care], \"QI\", Table13261720[[Duration ]])<= 3, SUMIF(Table13261720[Type of Care], \"QI\", Table13261720[[Duration ]]), 0))))  > 90, SUMIFS($G$86:G98, $D$86:D98,\"Direct/Indirect/Clinical Administration\",  $B$86:B98,\"<=\"&$D$83 + 14)+ ((IF(SUMIF(Table13261720[Type of Care], \"QI\", Table13261720[[Duration ]])>= 4, 4,IF(SUMIF(Table13261720[Type of Care], \"QI\", Table13261720[[Duration ]])<= 3, SUMIF(Table13261720[Type of Care], \"QI\", Table13261720[[Duration ]]), 0))))> 90)","v":false}]
[null,null,"",null,null,null,null,{"$f":"IF( B99 > $D$83+14, SUMIFS($G$86:G99, $D$86:D99,\"Direct/Indirect/Clinical Administration\", $B$86:B99,\">\"&$D$83 + 14) + ((IF(SUMIF(Table13261720[Type of Care], \"QI\", Table13261720[[Duration ]])>= 4, 4,IF(SUMIF(Table13261720[Type of Care], \"QI\", Table13261720[[Duration ]])<= 3, SUMIF(Table13261720[Type of Care], \"QI\", Table13261720[[Duration ]]), 0))))  > 90, SUMIFS($G$86:G99, $D$86:D99,\"Direct/Indirect/Clinical Administration\",  $B$86:B99,\"<=\"&$D$83 + 14)+ ((IF(SUMIF(Table13261720[Type of Care], \"QI\", Table13261720[[Duration ]])>= 4, 4,IF(SUMIF(Table13261720[Type of Care], \"QI\", Table13261720[[Duration ]])<= 3, SUMIF(Table13261720[Type of Care], \"QI\", Table13261720[[Duration ]]), 0))))> 90)","v":false}]
[null,null,"",null,null,null,null,{"$f":"IF( B100 > $D$83+14, SUMIFS($G$86:G100, $D$86:D100,\"Direct/Indirect/Clinical Administration\", $B$86:B100,\">\"&$D$83 + 14) + ((IF(SUMIF(Table13261720[Type of Care], \"QI\", Table13261720[[Duration ]])>= 4, 4,IF(SUMIF(Table13261720[Type of Care], \"QI\", Table13261720[[Duration ]])<= 3, SUMIF(Table13261720[Type of Care], \"QI\", Table13261720[[Duration ]]), 0))))  > 90, SUMIFS($G$86:G100, $D$86:D100,\"Direct/Indirect/Clinical Administration\",  $B$86:B100,\"<=\"&$D$83 + 14)+ ((IF(SUMIF(Table13261720[Type of Care], \"QI\", Table13261720[[Duration ]])>= 4, 4,IF(SUMIF(Table13261720[Type of Care], \"QI\", Table13261720[[Duration ]])<= 3, SUMIF(Table13261720[Type of Care], \"QI\", Table13261720[[Duration ]]), 0))))> 90)","v":false}]
[null,null,"",null,null,null,null,{"$f":"IF( B101 > $D$83+14, SUMIFS($G$86:G101, $D$86:D101,\"Direct/Indirect/Clinical Administration\", $B$86:B101,\">\"&$D$83 + 14) + ((IF(SUMIF(Table13261720[Type of Care], \"QI\", Table13261720[[Duration ]])>= 4, 4,IF(SUMIF(Table13261720[Type of Care], \"QI\", Table13261720[[Duration ]])<= 3, SUMIF(Table13261720[Type of Care], \"QI\", Table13261720[[Duration ]]), 0))))  > 90, SUMIFS($G$86:G101, $D$86:D101,\"Direct/Indirect/Clinical Administration\",  $B$86:B101,\"<=\"&$D$83 + 14)+ ((IF(SUMIF(Table13261720[Type of Care], \"QI\", Table13261720[[Duration ]])>= 4, 4,IF(SUMIF(Table13261720[Type of Care], \"QI\", Table13261720[[Duration ]])<= 3, SUMIF(Table13261720[Type of Care], \"QI\", Table13261720[[Duration ]]), 0))))> 90)","v":false}]
[null,null,"",null,null,null,null,{"$f":"IF( B102 > $D$83+14, SUMIFS($G$86:G102, $D$86:D102,\"Direct/Indirect/Clinical Administration\", $B$86:B102,\">\"&$D$83 + 14) + ((IF(SUMIF(Table13261720[Type of Care], \"QI\", Table13261720[[Duration ]])>= 4, 4,IF(SUMIF(Table13261720[Type of Care], \"QI\", Table13261720[[Duration ]])<= 3, SUMIF(Table13261720[Type of Care], \"QI\", Table13261720[[Duration ]]), 0))))  > 90, SUMIFS($G$86:G102, $D$86:D102,\"Direct/Indirect/Clinical Administration\",  $B$86:B102,\"<=\"&$D$83 + 14)+ ((IF(SUMIF(Table13261720[Type of Care], \"QI\", Table13261720[[Duration ]])>= 4, 4,IF(SUMIF(Table13261720[Type of Care], \"QI\", Table13261720[[Duration ]])<= 3, SUMIF(Table13261720[Type of Care], \"QI\", Table13261720[[Duration ]]), 0))))> 90)","v":false}]
[null,null,"",null,null,null,null,{"$f":"IF( B103 > $D$83+14, SUMIFS($G$86:G103, $D$86:D103,\"Direct/Indirect/Clinical Administration\", $B$86:B103,\">\"&$D$83 + 14) + ((IF(SUMIF(Table13261720[Type of Care], \"QI\", Table13261720[[Duration ]])>= 4, 4,IF(SUMIF(Table13261720[Type of Care], \"QI\", Table13261720[[Duration ]])<= 3, SUMIF(Table13261720[Type of Care], \"QI\", Table13261720[[Duration ]]), 0))))  > 90, SUMIFS($G$86:G103, $D$86:D103,\"Direct/Indirect/Clinical Administration\",  $B$86:B103,\"<=\"&$D$83 + 14)+ ((IF(SUMIF(Table13261720[Type of Care], \"QI\", Table13261720[[Duration ]])>= 4, 4,IF(SUMIF(Table13261720[Type of Care], \"QI\", Table13261720[[Duration ]])<= 3, SUMIF(Table13261720[Type of Care], \"QI\", Table13261720[[Duration ]]), 0))))> 90)","v":false}]
[null,null,"",null,null,null,null,{"$f":"IF( B104 > $D$83+14, SUMIFS($G$86:G104, $D$86:D104,\"Direct/Indirect/Clinical Administration\", $B$86:B104,\">\"&$D$83 + 14) + ((IF(SUMIF(Table13261720[Type of Care], \"QI\", Table13261720[[Duration ]])>= 4, 4,IF(SUMIF(Table13261720[Type of Care], \"QI\", Table13261720[[Duration ]])<= 3, SUMIF(Table13261720[Type of Care], \"QI\", Table13261720[[Duration ]]), 0))))  > 90, SUMIFS($G$86:G104, $D$86:D104,\"Direct/Indirect/Clinical Administration\",  $B$86:B104,\"<=\"&$D$83 + 14)+ ((IF(SUMIF(Table13261720[Type of Care], \"QI\", Table13261720[[Duration ]])>= 4, 4,IF(SUMIF(Table13261720[Type of Care], \"QI\", Table13261720[[Duration ]])<= 3, SUMIF(Table13261720[Type of Care], \"QI\", Table13261720[[Duration ]]), 0))))> 90)","v":false}]
[null,null,"",null,null,null,null,{"$f":"IF( B105 > $D$83+14, SUMIFS($G$86:G105, $D$86:D105,\"Direct/Indirect/Clinical Administration\", $B$86:B105,\">\"&$D$83 + 14) + ((IF(SUMIF(Table13261720[Type of Care], \"QI\", Table13261720[[Duration ]])>= 4, 4,IF(SUMIF(Table13261720[Type of Care], \"QI\", Table13261720[[Duration ]])<= 3, SUMIF(Table13261720[Type of Care], \"QI\", Table13261720[[Duration ]]), 0))))  > 90, SUMIFS($G$86:G105, $D$86:D105,\"Direct/Indirect/Clinical Administration\",  $B$86:B105,\"<=\"&$D$83 + 14)+ ((IF(SUMIF(Table13261720[Type of Care], \"QI\", Table13261720[[Duration ]])>= 4, 4,IF(SUMIF(Table13261720[Type of Care], \"QI\", Table13261720[[Duration ]])<= 3, SUMIF(Table13261720[Type of Care], \"QI\", Table13261720[[Duration ]]), 0))))> 90)","v":false}]
[null,null,"",null,null,null,null,{"$f":"IF( B106 > $D$83+14, SUMIFS($G$86:G106, $D$86:D106,\"Direct/Indirect/Clinical Administration\", $B$86:B106,\">\"&$D$83 + 14) + ((IF(SUMIF(Table13261720[Type of Care], \"QI\", Table13261720[[Duration ]])>= 4, 4,IF(SUMIF(Table13261720[Type of Care], \"QI\", Table13261720[[Duration ]])<= 3, SUMIF(Table13261720[Type of Care], \"QI\", Table13261720[[Duration ]]), 0))))  > 90, SUMIFS($G$86:G106, $D$86:D106,\"Direct/Indirect/Clinical Administration\",  $B$86:B106,\"<=\"&$D$83 + 14)+ ((IF(SUMIF(Table13261720[Type of Care], \"QI\", Table13261720[[Duration ]])>= 4, 4,IF(SUMIF(Table13261720[Type of Care], \"QI\", Table13261720[[Duration ]])<= 3, SUMIF(Table13261720[Type of Care], \"QI\", Table13261720[[Duration ]]), 0))))> 90)","v":false}]
[null,null,{"$f":"IF(B107=\"\", \"\", B107)","v":""},null,null,null,null,{"$f":"IF( B107 > $D$83+14, SUMIFS($G$86:G107, $D$86:D107,\"Direct/Indirect/Clinical Administration\", $B$86:B107,\">\"&$D$83 + 14) + ((IF(SUMIF(Table13261720[Type of Care], \"QI\", Table13261720[[Duration ]])>= 4, 4,IF(SUMIF(Table13261720[Type of Care], \"QI\", Table13261720[[Duration ]])<= 3, SUMIF(Table13261720[Type of Care], \"QI\", Table13261720[[Duration ]]), 0))))  > 90, SUMIFS($G$86:G107, $D$86:D107,\"Direct/Indirect/Clinical Administration\",  $B$86:B107,\"<=\"&$D$83 + 14)+ ((IF(SUMIF(Table13261720[Type of Care], \"QI\", Table13261720[[Duration ]])>= 4, 4,IF(SUMIF(Table13261720[Type of Care], \"QI\", Table13261720[[Duration ]])<= 3, SUMIF(Table13261720[Type of Care], \"QI\", Table13261720[[Duration ]]), 0))))> 90)","v":false}]
[null,null,{"$f":"IF(B108=\"\", \"\", B108)","v":""},null,null,null,null,{"$f":"IF( B108 > $D$83+14, SUMIFS($G$86:G108, $D$86:D108,\"Direct/Indirect/Clinical Administration\", $B$86:B108,\">\"&$D$83 + 14) + ((IF(SUMIF(Table13261720[Type of Care], \"QI\", Table13261720[[Duration ]])>= 4, 4,IF(SUMIF(Table13261720[Type of Care], \"QI\", Table13261720[[Duration ]])<= 3, SUMIF(Table13261720[Type of Care], \"QI\", Table13261720[[Duration ]]), 0))))  > 90, SUMIFS($G$86:G108, $D$86:D108,\"Direct/Indirect/Clinical Administration\",  $B$86:B108,\"<=\"&$D$83 + 14)+ ((IF(SUMIF(Table13261720[Type of Care], \"QI\", Table13261720[[Duration ]])>= 4, 4,IF(SUMIF(Table13261720[Type of Care], \"QI\", Table13261720[[Duration ]])<= 3, SUMIF(Table13261720[Type of Care], \"QI\", Table13261720[[Duration ]]), 0))))> 90)","v":false}]
[null,null,"",null,null,null,null,{"$f":"IF( B109 > $D$83+14, SUMIFS($G$86:G109, $D$86:D109,\"Direct/Indirect/Clinical Administration\", $B$86:B109,\">\"&$D$83 + 14) + ((IF(SUMIF(Table13261720[Type of Care], \"QI\", Table13261720[[Duration ]])>= 4, 4,IF(SUMIF(Table13261720[Type of Care], \"QI\", Table13261720[[Duration ]])<= 3, SUMIF(Table13261720[Type of Care], \"QI\", Table13261720[[Duration ]]), 0))))  > 90, SUMIFS($G$86:G109, $D$86:D109,\"Direct/Indirect/Clinical Administration\",  $B$86:B109,\"<=\"&$D$83 + 14)+ ((IF(SUMIF(Table13261720[Type of Care], \"QI\", Table13261720[[Duration ]])>= 4, 4,IF(SUMIF(Table13261720[Type of Care], \"QI\", Table13261720[[Duration ]])<= 3, SUMIF(Table13261720[Type of Care], \"QI\", Table13261720[[Duration ]]), 0))))> 90)","v":false}]
[null,null,"",null,null,null,null,{"$f":"IF( B110 > $D$83+14, SUMIFS($G$86:G110, $D$86:D110,\"Direct/Indirect/Clinical Administration\", $B$86:B110,\">\"&$D$83 + 14) + ((IF(SUMIF(Table13261720[Type of Care], \"QI\", Table13261720[[Duration ]])>= 4, 4,IF(SUMIF(Table13261720[Type of Care], \"QI\", Table13261720[[Duration ]])<= 3, SUMIF(Table13261720[Type of Care], \"QI\", Table13261720[[Duration ]]), 0))))  > 90, SUMIFS($G$86:G110, $D$86:D110,\"Direct/Indirect/Clinical Administration\",  $B$86:B110,\"<=\"&$D$83 + 14)+ ((IF(SUMIF(Table13261720[Type of Care], \"QI\", Table13261720[[Duration ]])>= 4, 4,IF(SUMIF(Table13261720[Type of Care], \"QI\", Table13261720[[Duration ]])<= 3, SUMIF(Table13261720[Type of Care], \"QI\", Table13261720[[Duration ]]), 0))))> 90)","v":false}]
[null,null,"",null,null,null,null,{"$f":"IF( B111 > $D$83+14, SUMIFS($G$86:G111, $D$86:D111,\"Direct/Indirect/Clinical Administration\", $B$86:B111,\">\"&$D$83 + 14) + ((IF(SUMIF(Table13261720[Type of Care], \"QI\", Table13261720[[Duration ]])>= 4, 4,IF(SUMIF(Table13261720[Type of Care], \"QI\", Table13261720[[Duration ]])<= 3, SUMIF(Table13261720[Type of Care], \"QI\", Table13261720[[Duration ]]), 0))))  > 90, SUMIFS($G$86:G111, $D$86:D111,\"Direct/Indirect/Clinical Administration\",  $B$86:B111,\"<=\"&$D$83 + 14)+ ((IF(SUMIF(Table13261720[Type of Care], \"QI\", Table13261720[[Duration ]])>= 4, 4,IF(SUMIF(Table13261720[Type of Care], \"QI\", Table13261720[[Duration ]])<= 3, SUMIF(Table13261720[Type of Care], \"QI\", Table13261720[[Duration ]]), 0))))> 90)","v":false}]
[null,null,"",null,null,null,null,{"$f":"IF( B112 > $D$83+14, SUMIFS($G$86:G112, $D$86:D112,\"Direct/Indirect/Clinical Administration\", $B$86:B112,\">\"&$D$83 + 14) + ((IF(SUMIF(Table13261720[Type of Care], \"QI\", Table13261720[[Duration ]])>= 4, 4,IF(SUMIF(Table13261720[Type of Care], \"QI\", Table13261720[[Duration ]])<= 3, SUMIF(Table13261720[Type of Care], \"QI\", Table13261720[[Duration ]]), 0))))  > 90, SUMIFS($G$86:G112, $D$86:D112,\"Direct/Indirect/Clinical Administration\",  $B$86:B112,\"<=\"&$D$83 + 14)+ ((IF(SUMIF(Table13261720[Type of Care], \"QI\", Table13261720[[Duration ]])>= 4, 4,IF(SUMIF(Table13261720[Type of Care], \"QI\", Table13261720[[Duration ]])<= 3, SUMIF(Table13261720[Type of Care], \"QI\", Table13261720[[Duration ]]), 0))))> 90)","v":false}]
[null,null,"",null,null,null,null,{"$f":"IF( B113 > $D$83+14, SUMIFS($G$86:G113, $D$86:D113,\"Direct/Indirect/Clinical Administration\", $B$86:B113,\">\"&$D$83 + 14) + ((IF(SUMIF(Table13261720[Type of Care], \"QI\", Table13261720[[Duration ]])>= 4, 4,IF(SUMIF(Table13261720[Type of Care], \"QI\", Table13261720[[Duration ]])<= 3, SUMIF(Table13261720[Type of Care], \"QI\", Table13261720[[Duration ]]), 0))))  > 90, SUMIFS($G$86:G113, $D$86:D113,\"Direct/Indirect/Clinical Administration\",  $B$86:B113,\"<=\"&$D$83 + 14)+ ((IF(SUMIF(Table13261720[Type of Care], \"QI\", Table13261720[[Duration ]])>= 4, 4,IF(SUMIF(Table13261720[Type of Care], \"QI\", Table13261720[[Duration ]])<= 3, SUMIF(Table13261720[Type of Care], \"QI\", Table13261720[[Duration ]]), 0))))> 90)","v":false}]
[null,null,{"$f":"IF(B114=\"\", \"\", B114)","v":""},null,null,null,null,{"$f":"IF( B114 > $D$83+14, SUMIFS($G$86:G114, $D$86:D114,\"Direct/Indirect/Clinical Administration\", $B$86:B114,\">\"&$D$83 + 14) + ((IF(SUMIF(Table13261720[Type of Care], \"QI\", Table13261720[[Duration ]])>= 4, 4,IF(SUMIF(Table13261720[Type of Care], \"QI\", Table13261720[[Duration ]])<= 3, SUMIF(Table13261720[Type of Care], \"QI\", Table13261720[[Duration ]]), 0))))  > 90, SUMIFS($G$86:G114, $D$86:D114,\"Direct/Indirect/Clinical Administration\",  $B$86:B114,\"<=\"&$D$83 + 14)+ ((IF(SUMIF(Table13261720[Type of Care], \"QI\", Table13261720[[Duration ]])>= 4, 4,IF(SUMIF(Table13261720[Type of Care], \"QI\", Table13261720[[Duration ]])<= 3, SUMIF(Table13261720[Type of Care], \"QI\", Table13261720[[Duration ]]), 0))))> 90)","v":false}]
[null,null,{"$f":"IF(B115=\"\", \"\", B115)","v":""},null,null,"Total Contract Hours",{"$f":"(SUMIF(Table13261720[Type of Care], \"Direct/Indirect/Clinical Administration\",Table13261720[[Duration ]]))","v":0},"CT3"]
[null,null,null,null,null,"Total Included QI Hours",{"$f":"(IF(SUMIF(Table13261720[Type of Care], \"QI\", Table13261720[[Duration ]])>= 4, 4,IF(SUMIF(Table13261720[Type of Care], \"QI\", Table13261720[[Duration ]])<= 3, SUMIF(Table13261720[Type of Care], \"QI\", Table13261720[[Duration ]]), 0)))","v":0},"QI3"]
[null,null,null,null,null,"Total Excluded Hours",{"$f":"G118+G119","v":0},"EX3"]
[null,null,null,null,null,"         Excluded Contract Hours",{"$f":"(SUMIF(Table13261720[Type of Care], \"Third Party/Specialist FFS\",Table13261720[[Duration ]])) + (SUMIF(Table13261720[Type of Care], \"Break (>15 Minutes)\", Table13261720[[Duration ]]))","v":0},"EXC3"]
[null,null,null,null,null,"      Excluded QI Hours",{"$f":"(SUMIF(Table13261720[Type of Care], \"QI\", Table13261720[[Duration ]]) - (IF(SUMIF(Table13261720[Type of Care], \"QI\", Table13261720[[Duration ]])>= 4, 4,IF(SUMIF(Table13261720[Type of Care], \"QI\", Table13261720[[Duration ]])<= 3, SUMIF(Table13261720[Type of Care], \"QI\", Table13261720[[Duration ]]), 0))))","v":0},"EXQI3"]
[null,null,{"$f":"IF(B120=\"\", \"\", B120)","v":""},null,null,"Hours Above 90hr/semi-monthly",{"$f":"  (IF(SUMIFS(Table13261720[[Duration ]],Table13261720[Date (YYYY-MM-DD)], \">\"&$D$83+14, Table13261720[Type of Care], \"Direct/Indirect/Clinical Administration\")>= 90, (SUMIFS(Table13261720[[Duration ]],Table13261720[Date (YYYY-MM-DD)], \">\"&$D$83+14, Table13261720[Type of Care], \"Direct/Indirect/Clinical Administration\")+ (IF(SUMIF(Table13261720[Type of Care], \"QI\", Table13261720[[Duration ]])>= 4, 4,IF(SUMIF(Table13261720[Type of Care], \"QI\", Table13261720[[Duration ]])<= 3, SUMIF(Table13261720[Type of Care], \"QI\",Table13261720[[Duration ]]), 0))) -90))) + (IF(SUMIFS(Table13261720[[Duration ]],Table13261720[Date (YYYY-MM-DD)], \"<=\"&$D$83+14, Table13261720[Type of Care], \"Direct/Indirect/Clinical Administration\")>= 90, (SUMIFS(Table13261720[[Duration ]],Table13261720[Date (YYYY-MM-DD)], \"<=\"&$D$83+14, Table13261720[Type of Care], \"Direct/Indirect/Clinical Administration\")+ (IF(SUMIF(Table13261720[Type of Care], \"QI\", Table13261720[[Duration ]])>= 4, 4,IF(SUMIF(Table13261720[Type of Care], \"QI\", Table13261720[[Duration ]])<= 3, SUMIF(Table13261720[Type of Care], \"QI\",Table13261720[[Duration ]]), 0))) -90)))","v":0},"A903"]

{"sheet":"Physician 4","index":4,"n_rows":120,"n_cols":8,"rows_kept":120,"cut":false,"hidden":false,"merged":[]}
[]
[null,"[Physician Name]"]
[null,"Practitioner #:",0]
[null,"Annual Rate: ",0]
[null,"Qrt. Disbursement: ",0]
[null,null,"Jan - Mar"]
[null,"Total Contract \nHours","Total Included \nQI Hours","Excluded Contract \nHours"]
[null,{"$f":"G35+G75+G115","v":0},{"$f":"G36+G76+G116","v":0},{"$f":"G37+G77+G117","v":0},null,null,null,"Totals"]
[]
[null,{"$f":"IF(Clinic!C5=\"Jan - Mar\", \"January\", IF(Clinic!C5= \"Apr - June\", \"April\", IF(Clinic!C5=\"July - Sept\", \"July\", IF(Clinic!C5=\" Oct - Dec\", \"October\"))))","v":"January"},{"$f":"Clinic!C6","v":2021},{"$f":"DATE(YEAR(B13),MONTH(DATEVALUE(B10&\"1\")),1)","v":"1900-01-01"},null,null,null,"Month1"]
[]
[null,"Date (YYYY-MM-DD)","Day ","Type of Care","Start Time AM/PM","End Time AM/PM","Duration","FALSE/TRUE"]
[null,null,{"$f":"IF(B13=\"\", \"\", B13)","v":""},null,null,null,null,{"$f":"IF( B13 > $D$10+14, SUMIFS($G$13:G13, $D$13:D13,\"Direct/Indirect/Clinical Administration\", $B$13:B13,\">\"&$D$10 + 14) + ((IF(SUMIF(Table1315187[Type of Care], \"QI\", Table1315187[Duration])>= 4, 4,IF(SUMIF(Table1315187[Type of Care], \"QI\", Table1315187[Duration])<= 3, SUMIF(Table1315187[Type of Care], \"QI\", Table1315187[Duration]), 0))))  > 90, SUMIFS($G$13:G13, $D$13:D13,\"Direct/Indirect/Clinical Administration\",  $B$13:B13,\"<=\"&$D$10 + 14)+ ((IF(SUMIF(Table1315187[Type of Care], \"QI\", Table1315187[Duration])>= 4, 4,IF(SUMIF(Table1315187[Type of Care], \"QI\", Table1315187[Duration])<= 3, SUMIF(Table1315187[Type of Care], \"QI\", Table1315187[Duration]), 0))))> 90)","v":false}]
[null,null,{"$f":"IF(B14=\"\", \"\", B14)","v":""},null,null,null,null,{"$f":"IF( B14 > $D$10+14, SUMIFS($G$13:G14, $D$13:D14,\"Direct/Indirect/Clinical Administration\", $B$13:B14,\">\"&$D$10 + 14) + ((IF(SUMIF(Table1315187[Type of Care], \"QI\", Table1315187[Duration])>= 4, 4,IF(SUMIF(Table1315187[Type of Care], \"QI\", Table1315187[Duration])<= 3, SUMIF(Table1315187[Type of Care], \"QI\", Table1315187[Duration]), 0))))  > 90, SUMIFS($G$13:G14, $D$13:D14,\"Direct/Indirect/Clinical Administration\",  $B$13:B14,\"<=\"&$D$10 + 14)+ ((IF(SUMIF(Table1315187[Type of Care], \"QI\", Table1315187[Duration])>= 4, 4,IF(SUMIF(Table1315187[Type of Care], \"QI\", Table1315187[Duration])<= 3, SUMIF(Table1315187[Type of Care], \"QI\", Table1315187[Duration]), 0))))> 90)","v":false}]
[null,null,{"$f":"IF(B15=\"\", \"\", B15)","v":""},null,null,null,null,{"$f":"IF( B15 > $D$10+14, SUMIFS($G$13:G15, $D$13:D15,\"Direct/Indirect/Clinical Administration\", $B$13:B15,\">\"&$D$10 + 14) + ((IF(SUMIF(Table1315187[Type of Care], \"QI\", Table1315187[Duration])>= 4, 4,IF(SUMIF(Table1315187[Type of Care], \"QI\", Table1315187[Duration])<= 3, SUMIF(Table1315187[Type of Care], \"QI\", Table1315187[Duration]), 0))))  > 90, SUMIFS($G$13:G15, $D$13:D15,\"Direct/Indirect/Clinical Administration\",  $B$13:B15,\"<=\"&$D$10 + 14)+ ((IF(SUMIF(Table1315187[Type of Care], \"QI\", Table1315187[Duration])>= 4, 4,IF(SUMIF(Table1315187[Type of Care], \"QI\", Table1315187[Duration])<= 3, SUMIF(Table1315187[Type of Care], \"QI\", Table1315187[Duration]), 0))))> 90)","v":false}]
[null,null,"",null,null,null,null,{"$f":"IF( B16 > $D$10+14, SUMIFS($G$13:G16, $D$13:D16,\"Direct/Indirect/Clinical Administration\", $B$13:B16,\">\"&$D$10 + 14) + ((IF(SUMIF(Table1315187[Type of Care], \"QI\", Table1315187[Duration])>= 4, 4,IF(SUMIF(Table1315187[Type of Care], \"QI\", Table1315187[Duration])<= 3, SUMIF(Table1315187[Type of Care], \"QI\", Table1315187[Duration]), 0))))  > 90, SUMIFS($G$13:G16, $D$13:D16,\"Direct/Indirect/Clinical Administration\",  $B$13:B16,\"<=\"&$D$10 + 14)+ ((IF(SUMIF(Table1315187[Type of Care], \"QI\", Table1315187[Duration])>= 4, 4,IF(SUMIF(Table1315187[Type of Care], \"QI\", Table1315187[Duration])<= 3, SUMIF(Table1315187[Type of Care], \"QI\", Table1315187[Duration]), 0))))> 90)","v":false}]
[null,null,"",null,null,null,null,{"$f":"IF( B17 > $D$10+14, SUMIFS($G$13:G17, $D$13:D17,\"Direct/Indirect/Clinical Administration\", $B$13:B17,\">\"&$D$10 + 14) + ((IF(SUMIF(Table1315187[Type of Care], \"QI\", Table1315187[Duration])>= 4, 4,IF(SUMIF(Table1315187[Type of Care], \"QI\", Table1315187[Duration])<= 3, SUMIF(Table1315187[Type of Care], \"QI\", Table1315187[Duration]), 0))))  > 90, SUMIFS($G$13:G17, $D$13:D17,\"Direct/Indirect/Clinical Administration\",  $B$13:B17,\"<=\"&$D$10 + 14)+ ((IF(SUMIF(Table1315187[Type of Care], \"QI\", Table1315187[Duration])>= 4, 4,IF(SUMIF(Table1315187[Type of Care], \"QI\", Table1315187[Duration])<= 3, SUMIF(Table1315187[Type of Care], \"QI\", Table1315187[Duration]), 0))))> 90)","v":false}]
[null,null,"",null,null,null,null,{"$f":"IF( B18 > $D$10+14, SUMIFS($G$13:G18, $D$13:D18,\"Direct/Indirect/Clinical Administration\", $B$13:B18,\">\"&$D$10 + 14) + ((IF(SUMIF(Table1315187[Type of Care], \"QI\", Table1315187[Duration])>= 4, 4,IF(SUMIF(Table1315187[Type of Care], \"QI\", Table1315187[Duration])<= 3, SUMIF(Table1315187[Type of Care], \"QI\", Table1315187[Duration]), 0))))  > 90, SUMIFS($G$13:G18, $D$13:D18,\"Direct/Indirect/Clinical Administration\",  $B$13:B18,\"<=\"&$D$10 + 14)+ ((IF(SUMIF(Table1315187[Type of Care], \"QI\", Table1315187[Duration])>= 4, 4,IF(SUMIF(Table1315187[Type of Care], \"QI\", Table1315187[Duration])<= 3, SUMIF(Table1315187[Type of Care], \"QI\", Table1315187[Duration]), 0))))> 90)","v":false}]
[null,null,"",null,null,null,null,{"$f":"IF( B19 > $D$10+14, SUMIFS($G$13:G19, $D$13:D19,\"Direct/Indirect/Clinical Administration\", $B$13:B19,\">\"&$D$10 + 14) + ((IF(SUMIF(Table1315187[Type of Care], \"QI\", Table1315187[Duration])>= 4, 4,IF(SUMIF(Table1315187[Type of Care], \"QI\", Table1315187[Duration])<= 3, SUMIF(Table1315187[Type of Care], \"QI\", Table1315187[Duration]), 0))))  > 90, SUMIFS($G$13:G19, $D$13:D19,\"Direct/Indirect/Clinical Administration\",  $B$13:B19,\"<=\"&$D$10 + 14)+ ((IF(SUMIF(Table1315187[Type of Care], \"QI\", Table1315187[Duration])>= 4, 4,IF(SUMIF(Table1315187[Type of Care], \"QI\", Table1315187[Duration])<= 3, SUMIF(Table1315187[Type of Care], \"QI\", Table1315187[Duration]), 0))))> 90)","v":false}]
[null,null,"",null,null,null,null,{"$f":"IF( B20 > $D$10+14, SUMIFS($G$13:G20, $D$13:D20,\"Direct/Indirect/Clinical Administration\", $B$13:B20,\">\"&$D$10 + 14) + ((IF(SUMIF(Table1315187[Type of Care], \"QI\", Table1315187[Duration])>= 4, 4,IF(SUMIF(Table1315187[Type of Care], \"QI\", Table1315187[Duration])<= 3, SUMIF(Table1315187[Type of Care], \"QI\", Table1315187[Duration]), 0))))  > 90, SUMIFS($G$13:G20, $D$13:D20,\"Direct/Indirect/Clinical Administration\",  $B$13:B20,\"<=\"&$D$10 + 14)+ ((IF(SUMIF(Table1315187[Type of Care], \"QI\", Table1315187[Duration])>= 4, 4,IF(SUMIF(Table1315187[Type of Care], \"QI\", Table1315187[Duration])<= 3, SUMIF(Table1315187[Type of Care], \"QI\", Table1315187[Duration]), 0))))> 90)","v":false}]
[null,null,"",null,null,null,null,{"$f":"IF( B21 > $D$10+14, SUMIFS($G$13:G21, $D$13:D21,\"Direct/Indirect/Clinical Administration\", $B$13:B21,\">\"&$D$10 + 14) + ((IF(SUMIF(Table1315187[Type of Care], \"QI\", Table1315187[Duration])>= 4, 4,IF(SUMIF(Table1315187[Type of Care], \"QI\", Table1315187[Duration])<= 3, SUMIF(Table1315187[Type of Care], \"QI\", Table1315187[Duration]), 0))))  > 90, SUMIFS($G$13:G21, $D$13:D21,\"Direct/Indirect/Clinical Administration\",  $B$13:B21,\"<=\"&$D$10 + 14)+ ((IF(SUMIF(Table1315187[Type of Care], \"QI\", Table1315187[Duration])>= 4, 4,IF(SUMIF(Table1315187[Type of Care], \"QI\", Table1315187[Duration])<= 3, SUMIF(Table1315187[Type of Care], \"QI\", Table1315187[Duration]), 0))))> 90)","v":false}]
[null,null,"",null,null,null,null,{"$f":"IF( B22 > $D$10+14, SUMIFS($G$13:G22, $D$13:D22,\"Direct/Indirect/Clinical Administration\", $B$13:B22,\">\"&$D$10 + 14) + ((IF(SUMIF(Table1315187[Type of Care], \"QI\", Table1315187[Duration])>= 4, 4,IF(SUMIF(Table1315187[Type of Care], \"QI\", Table1315187[Duration])<= 3, SUMIF(Table1315187[Type of Care], \"QI\", Table1315187[Duration]), 0))))  > 90, SUMIFS($G$13:G22, $D$13:D22,\"Direct/Indirect/Clinical Administration\",  $B$13:B22,\"<=\"&$D$10 + 14)+ ((IF(SUMIF(Table1315187[Type of Care], \"QI\", Table1315187[Duration])>= 4, 4,IF(SUMIF(Table1315187[Type of Care], \"QI\", Table1315187[Duration])<= 3, SUMIF(Table1315187[Type of Care], \"QI\", Table1315187[Duration]), 0))))> 90)","v":false}]
[null,null,"",null,null,null,null,{"$f":"IF( B23 > $D$10+14, SUMIFS($G$13:G23, $D$13:D23,\"Direct/Indirect/Clinical Administration\", $B$13:B23,\">\"&$D$10 + 14) + ((IF(SUMIF(Table1315187[Type of Care], \"QI\", Table1315187[Duration])>= 4, 4,IF(SUMIF(Table1315187[Type of Care], \"QI\", Table1315187[Duration])<= 3, SUMIF(Table1315187[Type of Care], \"QI\", Table1315187[Duration]), 0))))  > 90, SUMIFS($G$13:G23, $D$13:D23,\"Direct/Indirect/Clinical Administration\",  $B$13:B23,\"<=\"&$D$10 + 14)+ ((IF(SUMIF(Table1315187[Type of Care], \"QI\", Table1315187[Duration])>= 4, 4,IF(SUMIF(Table1315187[Type of Care], \"QI\", Table1315187[Duration])<= 3, SUMIF(Table1315187[Type of Care], \"QI\", Table1315187[Duration]), 0))))> 90)","v":false}]
[null,null,"",null,null,null,null,{"$f":"IF( B24 > $D$10+14, SUMIFS($G$13:G24, $D$13:D24,\"Direct/Indirect/Clinical Administration\", $B$13:B24,\">\"&$D$10 + 14) + ((IF(SUMIF(Table1315187[Type of Care], \"QI\", Table1315187[Duration])>= 4, 4,IF(SUMIF(Table1315187[Type of Care], \"QI\", Table1315187[Duration])<= 3, SUMIF(Table1315187[Type of Care], \"QI\", Table1315187[Duration]), 0))))  > 90, SUMIFS($G$13:G24, $D$13:D24,\"Direct/Indirect/Clinical Administration\",  $B$13:B24,\"<=\"&$D$10 + 14)+ ((IF(SUMIF(Table1315187[Type of Care], \"QI\", Table1315187[Duration])>= 4, 4,IF(SUMIF(Table1315187[Type of Care], \"QI\", Table1315187[Duration])<= 3, SUMIF(Table1315187[Type of Care], \"QI\", Table1315187[Duration]), 0))))> 90)","v":false}]
[null,null,"",null,null,null,null,{"$f":"IF( B25 > $D$10+14, SUMIFS($G$13:G25, $D$13:D25,\"Direct/Indirect/Clinical Administration\", $B$13:B25,\">\"&$D$10 + 14) + ((IF(SUMIF(Table1315187[Type of Care], \"QI\", Table1315187[Duration])>= 4, 4,IF(SUMIF(Table1315187[Type of Care], \"QI\", Table1315187[Duration])<= 3, SUMIF(Table1315187[Type of Care], \"QI\", Table1315187[Duration]), 0))))  > 90, SUMIFS($G$13:G25, $D$13:D25,\"Direct/Indirect/Clinical Administration\",  $B$13:B25,\"<=\"&$D$10 + 14)+ ((IF(SUMIF(Table1315187[Type of Care], \"QI\", Table1315187[Duration])>= 4, 4,IF(SUMIF(Table1315187[Type of Care], \"QI\", Table1315187[Duration])<= 3, SUMIF(Table1315187[Type of Care], \"QI\", Table1315187[Duration]), 0))))> 90)","v":false}]
[null,null,"",null,null,null,null,{"$f":"IF( B26 > $D$10+14, SUMIFS($G$13:G26, $D$13:D26,\"Direct/Indirect/Clinical Administration\", $B$13:B26,\">\"&$D$10 + 14) + ((IF(SUMIF(Table1315187[Type of Care], \"QI\", Table1315187[Duration])>= 4, 4,IF(SUMIF(Table1315187[Type of Care], \"QI\", Table1315187[Duration])<= 3, SUMIF(Table1315187[Type of Care], \"QI\", Table1315187[Duration]), 0))))  > 90, SUMIFS($G$13:G26, $D$13:D26,\"Direct/Indirect/Clinical Administration\",  $B$13:B26,\"<=\"&$D$10 + 14)+ ((IF(SUMIF(Table1315187[Type of Care], \"QI\", Table1315187[Duration])>= 4, 4,IF(SUMIF(Table1315187[Type of Care], \"QI\", Table1315187[Duration])<= 3, SUMIF(Table1315187[Type of Care], \"QI\", Table1315187[Duration]), 0))))> 90)","v":false}]
[null,null,"",null,null,null,null,{"$f":"IF( B27 > $D$10+14, SUMIFS($G$13:G27, $D$13:D27,\"Direct/Indirect/Clinical Administration\", $B$13:B27,\">\"&$D$10 + 14) + ((IF(SUMIF(Table1315187[Type of Care], \"QI\", Table1315187[Duration])>= 4, 4,IF(SUMIF(Table1315187[Type of Care], \"QI\", Table1315187[Duration])<= 3, SUMIF(Table1315187[Type of Care], \"QI\", Table1315187[Duration]), 0))))  > 90, SUMIFS($G$13:G27, $D$13:D27,\"Direct/Indirect/Clinical Administration\",  $B$13:B27,\"<=\"&$D$10 + 14)+ ((IF(SUMIF(Table1315187[Type of Care], \"QI\", Table1315187[Duration])>= 4, 4,IF(SUMIF(Table1315187[Type of Care], \"QI\", Table1315187[Duration])<= 3, SUMIF(Table1315187[Type of Care], \"QI\", Table1315187[Duration]), 0))))> 90)","v":false}]
[null,null,"",null,null,null,null,{"$f":"IF( B28 > $D$10+14, SUMIFS($G$13:G28, $D$13:D28,\"Direct/Indirect/Clinical Administration\", $B$13:B28,\">\"&$D$10 + 14) + ((IF(SUMIF(Table1315187[Type of Care], \"QI\", Table1315187[Duration])>= 4, 4,IF(SUMIF(Table1315187[Type of Care], \"QI\", Table1315187[Duration])<= 3, SUMIF(Table1315187[Type of Care], \"QI\", Table1315187[Duration]), 0))))  > 90, SUMIFS($G$13:G28, $D$13:D28,\"Direct/Indirect/Clinical Administration\",  $B$13:B28,\"<=\"&$D$10 + 14)+ ((IF(SUMIF(Table1315187[Type of Care], \"QI\", Table1315187[Duration])>= 4, 4,IF(SUMIF(Table1315187[Type of Care], \"QI\", Table1315187[Duration])<= 3, SUMIF(Table1315187[Type of Care], \"QI\", Table1315187[Duration]), 0))))> 90)","v":false}]
[null,null,"",null,null,null,null,{"$f":"IF( B29 > $D$10+14, SUMIFS($G$13:G29, $D$13:D29,\"Direct/Indirect/Clinical Administration\", $B$13:B29,\">\"&$D$10 + 14) + ((IF(SUMIF(Table1315187[Type of Care], \"QI\", Table1315187[Duration])>= 4, 4,IF(SUMIF(Table1315187[Type of Care], \"QI\", Table1315187[Duration])<= 3, SUMIF(Table1315187[Type of Care], \"QI\", Table1315187[Duration]), 0))))  > 90, SUMIFS($G$13:G29, $D$13:D29,\"Direct/Indirect/Clinical Administration\",  $B$13:B29,\"<=\"&$D$10 + 14)+ ((IF(SUMIF(Table1315187[Type of Care], \"QI\", Table1315187[Duration])>= 4, 4,IF(SUMIF(Table1315187[Type of Care], \"QI\", Table1315187[Duration])<= 3, SUMIF(Table1315187[Type of Care], \"QI\", Table1315187[Duration]), 0))))> 90)","v":false}]
[null,null,"",null,null,null,null,{"$f":"IF( B30 > $D$10+14, SUMIFS($G$13:G30, $D$13:D30,\"Direct/Indirect/Clinical Administration\", $B$13:B30,\">\"&$D$10 + 14) + ((IF(SUMIF(Table1315187[Type of Care], \"QI\", Table1315187[Duration])>= 4, 4,IF(SUMIF(Table1315187[Type of Care], \"QI\", Table1315187[Duration])<= 3, SUMIF(Table1315187[Type of Care], \"QI\", Table1315187[Duration]), 0))))  > 90, SUMIFS($G$13:G30, $D$13:D30,\"Direct/Indirect/Clinical Administration\",  $B$13:B30,\"<=\"&$D$10 + 14)+ ((IF(SUMIF(Table1315187[Type of Care], \"QI\", Table1315187[Duration])>= 4, 4,IF(SUMIF(Table1315187[Type of Care], \"QI\", Table1315187[Duration])<= 3, SUMIF(Table1315187[Type of Care], \"QI\", Table1315187[Duration]), 0))))> 90)","v":false}]
[null,null,"",null,null,null,null,{"$f":"IF( B31 > $D$10+14, SUMIFS($G$13:G31, $D$13:D31,\"Direct/Indirect/Clinical Administration\", $B$13:B31,\">\"&$D$10 + 14) + ((IF(SUMIF(Table1315187[Type of Care], \"QI\", Table1315187[Duration])>= 4, 4,IF(SUMIF(Table1315187[Type of Care], \"QI\", Table1315187[Duration])<= 3, SUMIF(Table1315187[Type of Care], \"QI\", Table1315187[Duration]), 0))))  > 90, SUMIFS($G$13:G31, $D$13:D31,\"Direct/Indirect/Clinical Administration\",  $B$13:B31,\"<=\"&$D$10 + 14)+ ((IF(SUMIF(Table1315187[Type of Care], \"QI\", Table1315187[Duration])>= 4, 4,IF(SUMIF(Table1315187[Type of Care], \"QI\", Table1315187[Duration])<= 3, SUMIF(Table1315187[Type of Care], \"QI\", Table1315187[Duration]), 0))))> 90)","v":false}]
[null,null,"",null,null,null,null,{"$f":"IF( B32 > $D$10+14, SUMIFS($G$13:G32, $D$13:D32,\"Direct/Indirect/Clinical Administration\", $B$13:B32,\">\"&$D$10 + 14) + ((IF(SUMIF(Table1315187[Type of Care], \"QI\", Table1315187[Duration])>= 4, 4,IF(SUMIF(Table1315187[Type of Care], \"QI\", Table1315187[Duration])<= 3, SUMIF(Table1315187[Type of Care], \"QI\", Table1315187[Duration]), 0))))  > 90, SUMIFS($G$13:G32, $D$13:D32,\"Direct/Indirect/Clinical Administration\",  $B$13:B32,\"<=\"&$D$10 + 14)+ ((IF(SUMIF(Table1315187[Type of Care], \"QI\", Table1315187[Duration])>= 4, 4,IF(SUMIF(Table1315187[Type of Care], \"QI\", Table1315187[Duration])<= 3, SUMIF(Table1315187[Type of Care], \"QI\", Table1315187[Duration]), 0))))> 90)","v":false}]
[null,null,"",null,null,null,null,{"$f":"IF( B33 > $D$10+14, SUMIFS($G$13:G33, $D$13:D33,\"Direct/Indirect/Clinical Administration\", $B$13:B33,\">\"&$D$10 + 14) + ((IF(SUMIF(Table1315187[Type of Care], \"QI\", Table1315187[Duration])>= 4, 4,IF(SUMIF(Table1315187[Type of Care], \"QI\", Table1315187[Duration])<= 3, SUMIF(Table1315187[Type of Care], \"QI\", Table1315187[Duration]), 0))))  > 90, SUMIFS($G$13:G33, $D$13:D33,\"Direct/Indirect/Clinical Administration\",  $B$13:B33,\"<=\"&$D$10 + 14)+ ((IF(SUMIF(Table1315187[Type of Care], \"QI\", Table1315187[Duration])>= 4, 4,IF(SUMIF(Table1315187[Type of Care], \"QI\", Table1315187[Duration])<= 3, SUMIF(Table1315187[Type of Care], \"QI\", Table1315187[Duration]), 0))))> 90)","v":false}]
[null,null,"",null,null,null,null,{"$f":"IF( B34 > $D$10+14, SUMIFS($G$13:G34, $D$13:D34,\"Direct/Indirect/Clinical Administration\", $B$13:B34,\">\"&$D$10 + 14) + ((IF(SUMIF(Table1315187[Type of Care], \"QI\", Table1315187[Duration])>= 4, 4,IF(SUMIF(Table1315187[Type of Care], \"QI\", Table1315187[Duration])<= 3, SUMIF(Table1315187[Type of Care], \"QI\", Table1315187[Duration]), 0))))  > 90, SUMIFS($G$13:G34, $D$13:D34,\"Direct/Indirect/Clinical Administration\",  $B$13:B34,\"<=\"&$D$10 + 14)+ ((IF(SUMIF(Table1315187[Type of Care], \"QI\", Table1315187[Duration])>= 4, 4,IF(SUMIF(Table1315187[Type of Care], \"QI\", Table1315187[Duration])<= 3, SUMIF(Table1315187[Type of Care], \"QI\", Table1315187[Duration]), 0))))> 90)","v":false}]
[null,null,{"$f":"IF(B35=\"\", \"\", B35)","v":""},null,null,"Total Contract Hours",{"$f":"(SUMIF(Table1315187[Type of Care], \"Direct/Indirect/Clinical Administration\",Table1315187[Duration]))","v":0},"CT1"]
[null,null,null,null,null,"Total Included QI Hours",{"$f":"(IF(SUMIF(Table1315187[Type of Care], \"QI\", Table1315187[Duration])>= 4, 4,IF(SUMIF(Table1315187[Type of Care], \"QI\", Table1315187[Duration])<= 3, SUMIF(Table1315187[Type of Care], \"QI\", Table1315187[Duration]), 0)))","v":0},"QI1"]
[null,null,null,null,null,"Total Excluded Hours",{"$f":"G38+G39","v":0},"EX1"]
[null,null,null,null,null,"         Excluded Contract Hours",{"$f":"(SUMIF(Table1315187[Type of Care], \"Third Party/Specialist FFS\",Table1315187[Duration])) + (SUMIF(Table1315187[Type of Care], \"Break (>15 Minutes)\", Table1315187[Duration]))","v":0},"EXC1"]
[null,null,null,null,null,"      Excluded QI Hours",{"$f":"(SUMIF(Table1315187[Type of Care], \"QI\", Table1315187[Duration]) - (IF(SUMIF(Table1315187[Type of Care], \"QI\", Table1315187[Duration])>= 4, 4,IF(SUMIF(Table1315187[Type of Care], \"QI\", Table1315187[Duration])<= 3, SUMIF(Table1315187[Type of Care], \"QI\", Table1315187[Duration]), 0))))","v":0},"EXQI1"]
[null,null,{"$f":"IF(B40=\"\", \"\", B40)","v":""},null,null,"Hours Above 90hr/semi-monthly",{"$f":"  (IF(SUMIFS(Table1315187[Duration],Table1315187[Date (YYYY-MM-DD)], \">\"&$D$10+14, Table1315187[Type of Care], \"Direct/Indirect/Clinical Administration\")>= 90, (SUMIFS(Table1315187[Duration],Table1315187[Date (YYYY-MM-DD)], \">\"&$D$10+14, Table1315187[Type of Care], \"Direct/Indirect/Clinical Administration\")+ (IF(SUMIF(Table1315187[Type of Care], \"QI\", Table1315187[Duration])>= 4, 4,IF(SUMIF(Table1315187[Type of Care], \"QI\", Table1315187[Duration])<= 3, SUMIF(Table1315187[Type of Care], \"QI\", Table1315187[Duration]), 0))) -90))) + (IF(SUMIFS(Table1315187[Duration],Table1315187[Date (YYYY-MM-DD)], \"<=\"&$D$10+14, Table1315187[Type of Care], \"Direct/Indirect/Clinical Administration\")>= 90, (SUMIFS(Table1315187[Duration],Table1315187[Date (YYYY-MM-DD)], \"<=\"&$D$10+14, Table1315187[Type of Care], \"Direct/Indirect/Clinical Administration\")+ (IF(SUMIF(Table1315187[Type of Care], \"QI\", Table1315187[Duration])>= 4, 4,IF(SUMIF(Table1315187[Type of Care], \"QI\", Table1315187[Duration])<= 3, SUMIF(Table1315187[Type of Care], \"QI\", Table1315187[Duration]), 0))) -90)))","v":0},"A901"]
[]
[]
[null,{"$f":"IF(Clinic!C5=\"Jan - Mar\", \"February\", IF(Clinic!C5= \"Apr - June\", \"May\", IF(Clinic!C5=\"July - Sept\", \"August\", IF(Clinic!C5=\" Oct - Dec\", \"November\"))))","v":"February"},{"$f":"Clinic!C6","v":2021},{"$f":"DATE(YEAR(B46),MONTH(DATEVALUE(B43&\"1\")),1)","v":"1900-02-01"},null,null,null,"Month2"]
[]
[null,"Date (YYYY-MM-DD)","Day ","Type of Care","Start Time AM/PM","End Time AM/PM","Duration","FALSE/TRUE"]
[null,null,{"$f":"IF(B46=\"\", \"\", B46)","v":""},null,null,null,null,{"$f":"IF( B46 > $D$43+14, SUMIFS($G$46:G46, $D$46:D46,\"Direct/Indirect/Clinical Administration\", $B$46:B46,\">\"&$D$43 + 14) + ((IF(SUMIF(Table13216198[Type of Care], \"QI\", Table13216198[Duration])>= 4, 4,IF(SUMIF(Table13216198[Type of Care], \"QI\", Table13216198[Duration])<= 3, SUMIF(Table13216198[Type of Care], \"QI\", Table13216198[Duration]), 0))))  > 90, SUMIFS($G$46:G46, $D$46:D46,\"Direct/Indirect/Clinical Administration\",  $B$46:B46,\"<=\"&$D$43 + 14)+ ((IF(SUMIF(Table13216198[Type of Care], \"QI\", Table13216198[Duration])>= 4, 4,IF(SUMIF(Table13216198[Type of Care], \"QI\", Table13216198[Duration])<= 3, SUMIF(Table13216198[Type of Care], \"QI\", Table13216198[Duration]), 0))))> 90)","v":false}]
[null,null,{"$f":"IF(B47=\"\", \"\", B47)","v":""},null,null,null,null,{"$f":"IF( B47 > $D$43+14, SUMIFS($G$46:G47, $D$46:D47,\"Direct/Indirect/Clinical Administration\", $B$46:B47,\">\"&$D$43 + 14) + ((IF(SUMIF(Table13216198[Type of Care], \"QI\", Table13216198[Duration])>= 4, 4,IF(SUMIF(Table13216198[Type of Care], \"QI\", Table13216198[Duration])<= 3, SUMIF(Table13216198[Type of Care], \"QI\", Table13216198[Duration]), 0))))  > 90, SUMIFS($G$46:G47, $D$46:D47,\"Direct/Indirect/Clinical Administration\",  $B$46:B47,\"<=\"&$D$43 + 14)+ ((IF(SUMIF(Table13216198[Type of Care], \"QI\", Table13216198[Duration])>= 4, 4,IF(SUMIF(Table13216198[Type of Care], \"QI\", Table13216198[Duration])<= 3, SUMIF(Table13216198[Type of Care], \"QI\", Table13216198[Duration]), 0))))> 90)","v":false}]
[null,null,"",null,null,null,null,{"$f":"IF( B48 > $D$43+14, SUMIFS($G$46:G48, $D$46:D48,\"Direct/Indirect/Clinical Administration\", $B$46:B48,\">\"&$D$43 + 14) + ((IF(SUMIF(Table13216198[Type of Care], \"QI\", Table13216198[Duration])>= 4, 4,IF(SUMIF(Table13216198[Type of Care], \"QI\", Table13216198[Duration])<= 3, SUMIF(Table13216198[Type of Care], \"QI\", Table13216198[Duration]), 0))))  > 90, SUMIFS($G$46:G48, $D$46:D48,\"Direct/Indirect/Clinical Administration\",  $B$46:B48,\"<=\"&$D$43 + 14)+ ((IF(SUMIF(Table13216198[Type of Care], \"QI\", Table13216198[Duration])>= 4, 4,IF(SUMIF(Table13216198[Type of Care], \"QI\", Table13216198[Duration])<= 3, SUMIF(Table13216198[Type of Care], \"QI\", Table13216198[Duration]), 0))))> 90)","v":false}]
[null,null,"",null,null,null,null,{"$f":"IF( B49 > $D$43+14, SUMIFS($G$46:G49, $D$46:D49,\"Direct/Indirect/Clinical Administration\", $B$46:B49,\">\"&$D$43 + 14) + ((IF(SUMIF(Table13216198[Type of Care], \"QI\", Table13216198[Duration])>= 4, 4,IF(SUMIF(Table13216198[Type of Care], \"QI\", Table13216198[Duration])<= 3, SUMIF(Table13216198[Type of Care], \"QI\", Table13216198[Duration]), 0))))  > 90, SUMIFS($G$46:G49, $D$46:D49,\"Direct/Indirect/Clinical Administration\",  $B$46:B49,\"<=\"&$D$43 + 14)+ ((IF(SUMIF(Table13216198[Type of Care], \"QI\", Table13216198[Duration])>= 4, 4,IF(SUMIF(Table13216198[Type of Care], \"QI\", Table13216198[Duration])<= 3, SUMIF(Table13216198[Type of Care], \"QI\", Table13216198[Duration]), 0))))> 90)","v":false}]
[null,null,"",null,null,null,null,{"$f":"IF( B50 > $D$43+14, SUMIFS($G$46:G50, $D$46:D50,\"Direct/Indirect/Clinical Administration\", $B$46:B50,\">\"&$D$43 + 14) + ((IF(SUMIF(Table13216198[Type of Care], \"QI\", Table13216198[Duration])>= 4, 4,IF(SUMIF(Table13216198[Type of Care], \"QI\", Table13216198[Duration])<= 3, SUMIF(Table13216198[Type of Care], \"QI\", Table13216198[Duration]), 0))))  > 90, SUMIFS($G$46:G50, $D$46:D50,\"Direct/Indirect/Clinical Administration\",  $B$46:B50,\"<=\"&$D$43 + 14)+ ((IF(SUMIF(Table13216198[Type of Care], \"QI\", Table13216198[Duration])>= 4, 4,IF(SUMIF(Table13216198[Type of Care], \"QI\", Table13216198[Duration])<= 3, SUMIF(Table13216198[Type of Care], \"QI\", Table13216198[Duration]), 0))))> 90)","v":false}]
[null,null,"",null,null,null,null,{"$f":"IF( B51 > $D$43+14, SUMIFS($G$46:G51, $D$46:D51,\"Direct/Indirect/Clinical Administration\", $B$46:B51,\">\"&$D$43 + 14) + ((IF(SUMIF(Table13216198[Type of Care], \"QI\", Table13216198[Duration])>= 4, 4,IF(SUMIF(Table13216198[Type of Care], \"QI\", Table13216198[Duration])<= 3, SUMIF(Table13216198[Type of Care], \"QI\", Table13216198[Duration]), 0))))  > 90, SUMIFS($G$46:G51, $D$46:D51,\"Direct/Indirect/Clinical Administration\",  $B$46:B51,\"<=\"&$D$43 + 14)+ ((IF(SUMIF(Table13216198[Type of Care], \"QI\", Table13216198[Duration])>= 4, 4,IF(SUMIF(Table13216198[Type of Care], \"QI\", Table13216198[Duration])<= 3, SUMIF(Table13216198[Type of Care], \"QI\", Table13216198[Duration]), 0))))> 90)","v":false}]
[null,null,"",null,null,null,null,{"$f":"IF( B52 > $D$43+14, SUMIFS($G$46:G52, $D$46:D52,\"Direct/Indirect/Clinical Administration\", $B$46:B52,\">\"&$D$43 + 14) + ((IF(SUMIF(Table13216198[Type of Care], \"QI\", Table13216198[Duration])>= 4, 4,IF(SUMIF(Table13216198[Type of Care], \"QI\", Table13216198[Duration])<= 3, SUMIF(Table13216198[Type of Care], \"QI\", Table13216198[Duration]), 0))))  > 90, SUMIFS($G$46:G52, $D$46:D52,\"Direct/Indirect/Clinical Administration\",  $B$46:B52,\"<=\"&$D$43 + 14)+ ((IF(SUMIF(Table13216198[Type of Care], \"QI\", Table13216198[Duration])>= 4, 4,IF(SUMIF(Table13216198[Type of Care], \"QI\", Table13216198[Duration])<= 3, SUMIF(Table13216198[Type of Care], \"QI\", Table13216198[Duration]), 0))))> 90)","v":false}]
[null,null,"",null,null,null,null,{"$f":"IF( B53 > $D$43+14, SUMIFS($G$46:G53, $D$46:D53,\"Direct/Indirect/Clinical Administration\", $B$46:B53,\">\"&$D$43 + 14) + ((IF(SUMIF(Table13216198[Type of Care], \"QI\", Table13216198[Duration])>= 4, 4,IF(SUMIF(Table13216198[Type of Care], \"QI\", Table13216198[Duration])<= 3, SUMIF(Table13216198[Type of Care], \"QI\", Table13216198[Duration]), 0))))  > 90, SUMIFS($G$46:G53, $D$46:D53,\"Direct/Indirect/Clinical Administration\",  $B$46:B53,\"<=\"&$D$43 + 14)+ ((IF(SUMIF(Table13216198[Type of Care], \"QI\", Table13216198[Duration])>= 4, 4,IF(SUMIF(Table13216198[Type of Care], \"QI\", Table13216198[Duration])<= 3, SUMIF(Table13216198[Type of Care], \"QI\", Table13216198[Duration]), 0))))> 90)","v":false}]
[null,null,"",null,null,null,null,{"$f":"IF( B54 > $D$43+14, SUMIFS($G$46:G54, $D$46:D54,\"Direct/Indirect/Clinical Administration\", $B$46:B54,\">\"&$D$43 + 14) + ((IF(SUMIF(Table13216198[Type of Care], \"QI\", Table13216198[Duration])>= 4, 4,IF(SUMIF(Table13216198[Type of Care], \"QI\", Table13216198[Duration])<= 3, SUMIF(Table13216198[Type of Care], \"QI\", Table13216198[Duration]), 0))))  > 90, SUMIFS($G$46:G54, $D$46:D54,\"Direct/Indirect/Clinical Administration\",  $B$46:B54,\"<=\"&$D$43 + 14)+ ((IF(SUMIF(Table13216198[Type of Care], \"QI\", Table13216198[Duration])>= 4, 4,IF(SUMIF(Table13216198[Type of Care], \"QI\", Table13216198[Duration])<= 3, SUMIF(Table13216198[Type of Care], \"QI\", Table13216198[Duration]), 0))))> 90)","v":false}]
[null,null,"",null,null,null,null,{"$f":"IF( B55 > $D$43+14, SUMIFS($G$46:G55, $D$46:D55,\"Direct/Indirect/Clinical Administration\", $B$46:B55,\">\"&$D$43 + 14) + ((IF(SUMIF(Table13216198[Type of Care], \"QI\", Table13216198[Duration])>= 4, 4,IF(SUMIF(Table13216198[Type of Care], \"QI\", Table13216198[Duration])<= 3, SUMIF(Table13216198[Type of Care], \"QI\", Table13216198[Duration]), 0))))  > 90, SUMIFS($G$46:G55, $D$46:D55,\"Direct/Indirect/Clinical Administration\",  $B$46:B55,\"<=\"&$D$43 + 14)+ ((IF(SUMIF(Table13216198[Type of Care], \"QI\", Table13216198[Duration])>= 4, 4,IF(SUMIF(Table13216198[Type of Care], \"QI\", Table13216198[Duration])<= 3, SUMIF(Table13216198[Type of Care], \"QI\", Table13216198[Duration]), 0))))> 90)","v":false}]
[null,null,"",null,null,null,null,{"$f":"IF( B56 > $D$43+14, SUMIFS($G$46:G56, $D$46:D56,\"Direct/Indirect/Clinical Administration\", $B$46:B56,\">\"&$D$43 + 14) + ((IF(SUMIF(Table13216198[Type of Care], \"QI\", Table13216198[Duration])>= 4, 4,IF(SUMIF(Table13216198[Type of Care], \"QI\", Table13216198[Duration])<= 3, SUMIF(Table13216198[Type of Care], \"QI\", Table13216198[Duration]), 0))))  > 90, SUMIFS($G$46:G56, $D$46:D56,\"Direct/Indirect/Clinical Administration\",  $B$46:B56,\"<=\"&$D$43 + 14)+ ((IF(SUMIF(Table13216198[Type of Care], \"QI\", Table13216198[Duration])>= 4, 4,IF(SUMIF(Table13216198[Type of Care], \"QI\", Table13216198[Duration])<= 3, SUMIF(Table13216198[Type of Care], \"QI\", Table13216198[Duration]), 0))))> 90)","v":false}]
[null,null,"",null,null,null,null,{"$f":"IF( B57 > $D$43+14, SUMIFS($G$46:G57, $D$46:D57,\"Direct/Indirect/Clinical Administration\", $B$46:B57,\">\"&$D$43 + 14) + ((IF(SUMIF(Table13216198[Type of Care], \"QI\", Table13216198[Duration])>= 4, 4,IF(SUMIF(Table13216198[Type of Care], \"QI\", Table13216198[Duration])<= 3, SUMIF(Table13216198[Type of Care], \"QI\", Table13216198[Duration]), 0))))  > 90, SUMIFS($G$46:G57, $D$46:D57,\"Direct/Indirect/Clinical Administration\",  $B$46:B57,\"<=\"&$D$43 + 14)+ ((IF(SUMIF(Table13216198[Type of Care], \"QI\", Table13216198[Duration])>= 4, 4,IF(SUMIF(Table13216198[Type of Care], \"QI\", Table13216198[Duration])<= 3, SUMIF(Table13216198[Type of Care], \"QI\", Table13216198[Duration]), 0))))> 90)","v":false}]
[null,null,"",null,null,null,null,{"$f":"IF( B58 > $D$43+14, SUMIFS($G$46:G58, $D$46:D58,\"Direct/Indirect/Clinical Administration\", $B$46:B58,\">\"&$D$43 + 14) + ((IF(SUMIF(Table13216198[Type of Care], \"QI\", Table13216198[Duration])>= 4, 4,IF(SUMIF(Table13216198[Type of Care], \"QI\", Table13216198[Duration])<= 3, SUMIF(Table13216198[Type of Care], \"QI\", Table13216198[Duration]), 0))))  > 90, SUMIFS($G$46:G58, $D$46:D58,\"Direct/Indirect/Clinical Administration\",  $B$46:B58,\"<=\"&$D$43 + 14)+ ((IF(SUMIF(Table13216198[Type of Care], \"QI\", Table13216198[Duration])>= 4, 4,IF(SUMIF(Table13216198[Type of Care], \"QI\", Table13216198[Duration])<= 3, SUMIF(Table13216198[Type of Care], \"QI\", Table13216198[Duration]), 0))))> 90)","v":false}]
[null,null,"",null,null,null,null,{"$f":"IF( B59 > $D$43+14, SUMIFS($G$46:G59, $D$46:D59,\"Direct/Indirect/Clinical Administration\", $B$46:B59,\">\"&$D$43 + 14) + ((IF(SUMIF(Table13216198[Type of Care], \"QI\", Table13216198[Duration])>= 4, 4,IF(SUMIF(Table13216198[Type of Care], \"QI\", Table13216198[Duration])<= 3, SUMIF(Table13216198[Type of Care], \"QI\", Table13216198[Duration]), 0))))  > 90, SUMIFS($G$46:G59, $D$46:D59,\"Direct/Indirect/Clinical Administration\",  $B$46:B59,\"<=\"&$D$43 + 14)+ ((IF(SUMIF(Table13216198[Type of Care], \"QI\", Table13216198[Duration])>= 4, 4,IF(SUMIF(Table13216198[Type of Care], \"QI\", Table13216198[Duration])<= 3, SUMIF(Table13216198[Type of Care], \"QI\", Table13216198[Duration]), 0))))> 90)","v":false}]
[null,null,"",null,null,null,null,{"$f":"IF( B60 > $D$43+14, SUMIFS($G$46:G60, $D$46:D60,\"Direct/Indirect/Clinical Administration\", $B$46:B60,\">\"&$D$43 + 14) + ((IF(SUMIF(Table13216198[Type of Care], \"QI\", Table13216198[Duration])>= 4, 4,IF(SUMIF(Table13216198[Type of Care], \"QI\", Table13216198[Duration])<= 3, SUMIF(Table13216198[Type of Care], \"QI\", Table13216198[Duration]), 0))))  > 90, SUMIFS($G$46:G60, $D$46:D60,\"Direct/Indirect/Clinical Administration\",  $B$46:B60,\"<=\"&$D$43 + 14)+ ((IF(SUMIF(Table13216198[Type of Care], \"QI\", Table13216198[Duration])>= 4, 4,IF(SUMIF(Table13216198[Type of Care], \"QI\", Table13216198[Duration])<= 3, SUMIF(Table13216198[Type of Care], \"QI\", Table13216198[Duration]), 0))))> 90)","v":false}]
[null,null,"",null,null,null,null,{"$f":"IF( B61 > $D$43+14, SUMIFS($G$46:G61, $D$46:D61,\"Direct/Indirect/Clinical Administration\", $B$46:B61,\">\"&$D$43 + 14) + ((IF(SUMIF(Table13216198[Type of Care], \"QI\", Table13216198[Duration])>= 4, 4,IF(SUMIF(Table13216198[Type of Care], \"QI\", Table13216198[Duration])<= 3, SUMIF(Table13216198[Type of Care], \"QI\", Table13216198[Duration]), 0))))  > 90, SUMIFS($G$46:G61, $D$46:D61,\"Direct/Indirect/Clinical Administration\",  $B$46:B61,\"<=\"&$D$43 + 14)+ ((IF(SUMIF(Table13216198[Type of Care], \"QI\", Table13216198[Duration])>= 4, 4,IF(SUMIF(Table13216198[Type of Care], \"QI\", Table13216198[Duration])<= 3, SUMIF(Table13216198[Type of Care], \"QI\", Table13216198[Duration]), 0))))> 90)","v":false}]
[null,null,"",null,null,null,null,{"$f":"IF( B62 > $D$43+14, SUMIFS($G$46:G62, $D$46:D62,\"Direct/Indirect/Clinical Administration\", $B$46:B62,\">\"&$D$43 + 14) + ((IF(SUMIF(Table13216198[Type of Care], \"QI\", Table13216198[Duration])>= 4, 4,IF(SUMIF(Table13216198[Type of Care], \"QI\", Table13216198[Duration])<= 3, SUMIF(Table13216198[Type of Care], \"QI\", Table13216198[Duration]), 0))))  > 90, SUMIFS($G$46:G62, $D$46:D62,\"Direct/Indirect/Clinical Administration\",  $B$46:B62,\"<=\"&$D$43 + 14)+ ((IF(SUMIF(Table13216198[Type of Care], \"QI\", Table13216198[Duration])>= 4, 4,IF(SUMIF(Table13216198[Type of Care], \"QI\", Table13216198[Duration])<= 3, SUMIF(Table13216198[Type of Care], \"QI\", Table13216198[Duration]), 0))))> 90)","v":false}]
[null,null,"",null,null,null,null,{"$f":"IF( B63 > $D$43+14, SUMIFS($G$46:G63, $D$46:D63,\"Direct/Indirect/Clinical Administration\", $B$46:B63,\">\"&$D$43 + 14) + ((IF(SUMIF(Table13216198[Type of Care], \"QI\", Table13216198[Duration])>= 4, 4,IF(SUMIF(Table13216198[Type of Care], \"QI\", Table13216198[Duration])<= 3, SUMIF(Table13216198[Type of Care], \"QI\", Table13216198[Duration]), 0))))  > 90, SUMIFS($G$46:G63, $D$46:D63,\"Direct/Indirect/Clinical Administration\",  $B$46:B63,\"<=\"&$D$43 + 14)+ ((IF(SUMIF(Table13216198[Type of Care], \"QI\", Table13216198[Duration])>= 4, 4,IF(SUMIF(Table13216198[Type of Care], \"QI\", Table13216198[Duration])<= 3, SUMIF(Table13216198[Type of Care], \"QI\", Table13216198[Duration]), 0))))> 90)","v":false}]
[null,null,"",null,null,null,null,{"$f":"IF( B64 > $D$43+14, SUMIFS($G$46:G64, $D$46:D64,\"Direct/Indirect/Clinical Administration\", $B$46:B64,\">\"&$D$43 + 14) + ((IF(SUMIF(Table13216198[Type of Care], \"QI\", Table13216198[Duration])>= 4, 4,IF(SUMIF(Table13216198[Type of Care], \"QI\", Table13216198[Duration])<= 3, SUMIF(Table13216198[Type of Care], \"QI\", Table13216198[Duration]), 0))))  > 90, SUMIFS($G$46:G64, $D$46:D64,\"Direct/Indirect/Clinical Administration\",  $B$46:B64,\"<=\"&$D$43 + 14)+ ((IF(SUMIF(Table13216198[Type of Care], \"QI\", Table13216198[Duration])>= 4, 4,IF(SUMIF(Table13216198[Type of Care], \"QI\", Table13216198[Duration])<= 3, SUMIF(Table13216198[Type of Care], \"QI\", Table13216198[Duration]), 0))))> 90)","v":false}]
[null,null,"",null,null,null,null,{"$f":"IF( B65 > $D$43+14, SUMIFS($G$46:G65, $D$46:D65,\"Direct/Indirect/Clinical Administration\", $B$46:B65,\">\"&$D$43 + 14) + ((IF(SUMIF(Table13216198[Type of Care], \"QI\", Table13216198[Duration])>= 4, 4,IF(SUMIF(Table13216198[Type of Care], \"QI\", Table13216198[Duration])<= 3, SUMIF(Table13216198[Type of Care], \"QI\", Table13216198[Duration]), 0))))  > 90, SUMIFS($G$46:G65, $D$46:D65,\"Direct/Indirect/Clinical Administration\",  $B$46:B65,\"<=\"&$D$43 + 14)+ ((IF(SUMIF(Table13216198[Type of Care], \"QI\", Table13216198[Duration])>= 4, 4,IF(SUMIF(Table13216198[Type of Care], \"QI\", Table13216198[Duration])<= 3, SUMIF(Table13216198[Type of Care], \"QI\", Table13216198[Duration]), 0))))> 90)","v":false}]
[null,null,"",null,null,null,null,{"$f":"IF( B66 > $D$43+14, SUMIFS($G$46:G66, $D$46:D66,\"Direct/Indirect/Clinical Administration\", $B$46:B66,\">\"&$D$43 + 14) + ((IF(SUMIF(Table13216198[Type of Care], \"QI\", Table13216198[Duration])>= 4, 4,IF(SUMIF(Table13216198[Type of Care], \"QI\", Table13216198[Duration])<= 3, SUMIF(Table13216198[Type of Care], \"QI\", Table13216198[Duration]), 0))))  > 90, SUMIFS($G$46:G66, $D$46:D66,\"Direct/Indirect/Clinical Administration\",  $B$46:B66,\"<=\"&$D$43 + 14)+ ((IF(SUMIF(Table13216198[Type of Care], \"QI\", Table13216198[Duration])>= 4, 4,IF(SUMIF(Table13216198[Type of Care], \"QI\", Table13216198[Duration])<= 3, SUMIF(Table13216198[Type of Care], \"QI\", Table13216198[Duration]), 0))))> 90)","v":false}]
[null,null,"",null,null,null,null,{"$f":"IF( B67 > $D$43+14, SUMIFS($G$46:G67, $D$46:D67,\"Direct/Indirect/Clinical Administration\", $B$46:B67,\">\"&$D$43 + 14) + ((IF(SUMIF(Table13216198[Type of Care], \"QI\", Table13216198[Duration])>= 4, 4,IF(SUMIF(Table13216198[Type of Care], \"QI\", Table13216198[Duration])<= 3, SUMIF(Table13216198[Type of Care], \"QI\", Table13216198[Duration]), 0))))  > 90, SUMIFS($G$46:G67, $D$46:D67,\"Direct/Indirect/Clinical Administration\",  $B$46:B67,\"<=\"&$D$43 + 14)+ ((IF(SUMIF(Table13216198[Type of Care], \"QI\", Table13216198[Duration])>= 4, 4,IF(SUMIF(Table13216198[Type of Care], \"QI\", Table13216198[Duration])<= 3, SUMIF(Table13216198[Type of Care], \"QI\", Table13216198[Duration]), 0))))> 90)","v":false}]
[null,null,"",null,null,null,null,{"$f":"IF( B68 > $D$43+14, SUMIFS($G$46:G68, $D$46:D68,\"Direct/Indirect/Clinical Administration\", $B$46:B68,\">\"&$D$43 + 14) + ((IF(SUMIF(Table13216198[Type of Care], \"QI\", Table13216198[Duration])>= 4, 4,IF(SUMIF(Table13216198[Type of Care], \"QI\", Table13216198[Duration])<= 3, SUMIF(Table13216198[Type of Care], \"QI\", Table13216198[Duration]), 0))))  > 90, SUMIFS($G$46:G68, $D$46:D68,\"Direct/Indirect/Clinical Administration\",  $B$46:B68,\"<=\"&$D$43 + 14)+ ((IF(SUMIF(Table13216198[Type of Care], \"QI\", Table13216198[Duration])>= 4, 4,IF(SUMIF(Table13216198[Type of Care], \"QI\", Table13216198[Duration])<= 3, SUMIF(Table13216198[Type of Care], \"QI\", Table13216198[Duration]), 0))))> 90)","v":false}]
[null,null,"",null,null,null,null,{"$f":"IF( B69 > $D$43+14, SUMIFS($G$46:G69, $D$46:D69,\"Direct/Indirect/Clinical Administration\", $B$46:B69,\">\"&$D$43 + 14) + ((IF(SUMIF(Table13216198[Type of Care], \"QI\", Table13216198[Duration])>= 4, 4,IF(SUMIF(Table13216198[Type of Care], \"QI\", Table13216198[Duration])<= 3, SUMIF(Table13216198[Type of Care], \"QI\", Table13216198[Duration]), 0))))  > 90, SUMIFS($G$46:G69, $D$46:D69,\"Direct/Indirect/Clinical Administration\",  $B$46:B69,\"<=\"&$D$43 + 14)+ ((IF(SUMIF(Table13216198[Type of Care], \"QI\", Table13216198[Duration])>= 4, 4,IF(SUMIF(Table13216198[Type of Care], \"QI\", Table13216198[Duration])<= 3, SUMIF(Table13216198[Type of Care], \"QI\", Table13216198[Duration]), 0))))> 90)","v":false}]
[null,null,"",null,null,null,null,{"$f":"IF( B70 > $D$43+14, SUMIFS($G$46:G70, $D$46:D70,\"Direct/Indirect/Clinical Administration\", $B$46:B70,\">\"&$D$43 + 14) + ((IF(SUMIF(Table13216198[Type of Care], \"QI\", Table13216198[Duration])>= 4, 4,IF(SUMIF(Table13216198[Type of Care], \"QI\", Table13216198[Duration])<= 3, SUMIF(Table13216198[Type of Care], \"QI\", Table13216198[Duration]), 0))))  > 90, SUMIFS($G$46:G70, $D$46:D70,\"Direct/Indirect/Clinical Administration\",  $B$46:B70,\"<=\"&$D$43 + 14)+ ((IF(SUMIF(Table13216198[Type of Care], \"QI\", Table13216198[Duration])>= 4, 4,IF(SUMIF(Table13216198[Type of Care], \"QI\", Table13216198[Duration])<= 3, SUMIF(Table13216198[Type of Care], \"QI\", Table13216198[Duration]), 0))))> 90)","v":false}]
[null,null,"",null,null,null,null,{"$f":"IF( B71 > $D$43+14, SUMIFS($G$46:G71, $D$46:D71,\"Direct/Indirect/Clinical Administration\", $B$46:B71,\">\"&$D$43 + 14) + ((IF(SUMIF(Table13216198[Type of Care], \"QI\", Table13216198[Duration])>= 4, 4,IF(SUMIF(Table13216198[Type of Care], \"QI\", Table13216198[Duration])<= 3, SUMIF(Table13216198[Type of Care], \"QI\", Table13216198[Duration]), 0))))  > 90, SUMIFS($G$46:G71, $D$46:D71,\"Direct/Indirect/Clinical Administration\",  $B$46:B71,\"<=\"&$D$43 + 14)+ ((IF(SUMIF(Table13216198[Type of Care], \"QI\", Table13216198[Duration])>= 4, 4,IF(SUMIF(Table13216198[Type of Care], \"QI\", Table13216198[Duration])<= 3, SUMIF(Table13216198[Type of Care], \"QI\", Table13216198[Duration]), 0))))> 90)","v":false}]
[null,null,"",null,null,null,null,{"$f":"IF( B72 > $D$43+14, SUMIFS($G$46:G72, $D$46:D72,\"Direct/Indirect/Clinical Administration\", $B$46:B72,\">\"&$D$43 + 14) + ((IF(SUMIF(Table13216198[Type of Care], \"QI\", Table13216198[Duration])>= 4, 4,IF(SUMIF(Table13216198[Type of Care], \"QI\", Table13216198[Duration])<= 3, SUMIF(Table13216198[Type of Care], \"QI\", Table13216198[Duration]), 0))))  > 90, SUMIFS($G$46:G72, $D$46:D72,\"Direct/Indirect/Clinical Administration\",  $B$46:B72,\"<=\"&$D$43 + 14)+ ((IF(SUMIF(Table13216198[Type of Care], \"QI\", Table13216198[Duration])>= 4, 4,IF(SUMIF(Table13216198[Type of Care], \"QI\", Table13216198[Duration])<= 3, SUMIF(Table13216198[Type of Care], \"QI\", Table13216198[Duration]), 0))))> 90)","v":false}]
[null,null,"",null,null,null,null,{"$f":"IF( B73 > $D$43+14, SUMIFS($G$46:G73, $D$46:D73,\"Direct/Indirect/Clinical Administration\", $B$46:B73,\">\"&$D$43 + 14) + ((IF(SUMIF(Table13216198[Type of Care], \"QI\", Table13216198[Duration])>= 4, 4,IF(SUMIF(Table13216198[Type of Care], \"QI\", Table13216198[Duration])<= 3, SUMIF(Table13216198[Type of Care], \"QI\", Table13216198[Duration]), 0))))  > 90, SUMIFS($G$46:G73, $D$46:D73,\"Direct/Indirect/Clinical Administration\",  $B$46:B73,\"<=\"&$D$43 + 14)+ ((IF(SUMIF(Table13216198[Type of Care], \"QI\", Table13216198[Duration])>= 4, 4,IF(SUMIF(Table13216198[Type of Care], \"QI\", Table13216198[Duration])<= 3, SUMIF(Table13216198[Type of Care], \"QI\", Table13216198[Duration]), 0))))> 90)","v":false}]
[null,null,"",null,null,null,null,{"$f":"IF( B74 > $D$43+14, SUMIFS($G$46:G74, $D$46:D74,\"Direct/Indirect/Clinical Administration\", $B$46:B74,\">\"&$D$43 + 14) + ((IF(SUMIF(Table13216198[Type of Care], \"QI\", Table13216198[Duration])>= 4, 4,IF(SUMIF(Table13216198[Type of Care], \"QI\", Table13216198[Duration])<= 3, SUMIF(Table13216198[Type of Care], \"QI\", Table13216198[Duration]), 0))))  > 90, SUMIFS($G$46:G74, $D$46:D74,\"Direct/Indirect/Clinical Administration\",  $B$46:B74,\"<=\"&$D$43 + 14)+ ((IF(SUMIF(Table13216198[Type of Care], \"QI\", Table13216198[Duration])>= 4, 4,IF(SUMIF(Table13216198[Type of Care], \"QI\", Table13216198[Duration])<= 3, SUMIF(Table13216198[Type of Care], \"QI\", Table13216198[Duration]), 0))))> 90)","v":false}]
[null,null,{"$f":"IF(B75=\"\", \"\", B75)","v":""},null,null,"Total Contract Hours",{"$f":"(SUMIF(Table13216198[Type of Care], \"Direct/Indirect/Clinical Administration\",Table13216198[Duration])) + (SUMIF(Table13216198[Type of Care], \"Correction Hours\",Table13216198[Duration]))","v":0},"CT2"]
[null,null,null,null,null,"Total Included QI Hours",{"$f":"(IF(SUMIF(Table13216198[Type of Care], \"QI\", Table13216198[Duration])>= 4, 4,IF(SUMIF(Table13216198[Type of Care], \"QI\", Table13216198[Duration])<= 3, SUMIF(Table13216198[Type of Care], \"QI\", Table13216198[Duration]), 0)))","v":0},"QI2"]
[null,null,null,null,null,"Total Excluded Hours",{"$f":"G78+G79","v":0},"EX2"]
[null,null,null,null,null,"         Excluded Contract Hours",{"$f":"(SUMIF(Table13216198[Type of Care], \"Third Party/Specialist FFS\",Table13216198[Duration])) + (SUMIF(Table13216198[Type of Care], \"Break (>15 Minutes)\", Table13216198[Duration]))","v":0},"EXC2"]
[null,null,null,null,null,"      Excluded QI Hours",{"$f":"(SUMIF(Table13216198[Type of Care], \"QI\", Table13216198[Duration]) - (IF(SUMIF(Table13216198[Type of Care], \"QI\", Table13216198[Duration])>= 4, 4,IF(SUMIF(Table13216198[Type of Care], \"QI\", Table13216198[Duration])<= 3, SUMIF(Table13216198[Type of Care], \"QI\", Table13216198[Duration]), 0))))","v":0},"EXQI2"]
[null,null,{"$f":"IF(B80=\"\", \"\", B80)","v":""},null,null,"Hours Above 90hr/semi-monthly",{"$f":"  (IF(SUMIFS(Table13216198[Duration],Table13216198[Date (YYYY-MM-DD)], \">\"&$D$43+14, Table13216198[Type of Care], \"Direct/Indirect/Clinical Administration\")>= 90, (SUMIFS(Table13216198[Duration],Table13216198[Date (YYYY-MM-DD)], \">\"&$D$43+14, Table13216198[Type of Care], \"Direct/Indirect/Clinical Administration\")+ (IF(SUMIF(Table13216198[Type of Care], \"QI\", Table13216198[Duration])>= 4, 4,IF(SUMIF(Table13216198[Type of Care], \"QI\", Table13216198[Duration])<= 3, SUMIF(Table13216198[Type of Care], \"QI\", Table13216198[Duration]), 0))) -90))) + (IF(SUMIFS(Table13216198[Duration],Table13216198[Date (YYYY-MM-DD)], \"<=\"&$D$43+14, Table13216198[Type of Care], \"Direct/Indirect/Clinical Administration\")>= 90, (SUMIFS(Table13216198[Duration],Table13216198[Date (YYYY-MM-DD)], \"<=\"&$D$43+14, Table13216198[Type of Care], \"Direct/Indirect/Clinical Administration\")+ (IF(SUMIF(Table13216198[Type of Care], \"QI\", Table13216198[Duration])>= 4, 4,IF(SUMIF(Table13216198[Type of Care], \"QI\", Table13216198[Duration])<= 3, SUMIF(Table13216198[Type of Care], \"QI\", Table13216198[Duration]), 0))) -90)))","v":0},"A902"]
[]
[]
[null,{"$f":"IF(Clinic!C5=\"Jan - Mar\", \"March\", IF(Clinic!C5= \"Apr - June\", \"June\", IF(Clinic!C5=\"July - Sept\", \"September\", IF(Clinic!C5=\" Oct - Dec\", \"December\"))))","v":"March"},{"$f":"Clinic!C6","v":2021},{"$f":"DATE(YEAR(B86),MONTH(DATEVALUE(B83&\"1\")),1)","v":"1900-03-01"},null,null,null,"Month3"]
[]
[null,"Date (YYYY-MM-DD)","Day ","Type of Care","Start Time AM/PM","End Time AM/PM","Duration ","FALSE/TRUE"]
[null,null,{"$f":"IF(B86=\"\", \"\", B86)","v":""},null,null,null,null,{"$f":"IF( B86 > $D$83+14, SUMIFS($G$86:G86, $D$86:D86,\"Direct/Indirect/Clinical Administration\", $B$86:B86,\">\"&$D$83 + 14) + ((IF(SUMIF(Table132617209[Type of Care], \"QI\", Table132617209[[Duration ]])>= 4, 4,IF(SUMIF(Table132617209[Type of Care], \"QI\", Table132617209[[Duration ]])<= 3, SUMIF(Table132617209[Type of Care], \"QI\", Table132617209[[Duration ]]), 0))))  > 90, SUMIFS($G$86:G86, $D$86:D86,\"Direct/Indirect/Clinical Administration\",  $B$86:B86,\"<=\"&$D$83 + 14)+ ((IF(SUMIF(Table132617209[Type of Care], \"QI\", Table132617209[[Duration ]])>= 4, 4,IF(SUMIF(Table132617209[Type of Care], \"QI\", Table132617209[[Duration ]])<= 3, SUMIF(Table132617209[Type of Care], \"QI\", Table132617209[[Duration ]]), 0))))> 90)","v":false}]
[null,null,{"$f":"IF(B87=\"\", \"\", B87)","v":""},null,null,null,null,{"$f":"IF( B87 > $D$83+14, SUMIFS($G$86:G87, $D$86:D87,\"Direct/Indirect/Clinical Administration\", $B$86:B87,\">\"&$D$83 + 14) + ((IF(SUMIF(Table132617209[Type of Care], \"QI\", Table132617209[[Duration ]])>= 4, 4,IF(SUMIF(Table132617209[Type of Care], \"QI\", Table132617209[[Duration ]])<= 3, SUMIF(Table132617209[Type of Care], \"QI\", Table132617209[[Duration ]]), 0))))  > 90, SUMIFS($G$86:G87, $D$86:D87,\"Direct/Indirect/Clinical Administration\",  $B$86:B87,\"<=\"&$D$83 + 14)+ ((IF(SUMIF(Table132617209[Type of Care], \"QI\", Table132617209[[Duration ]])>= 4, 4,IF(SUMIF(Table132617209[Type of Care], \"QI\", Table132617209[[Duration ]])<= 3, SUMIF(Table132617209[Type of Care], \"QI\", Table132617209[[Duration ]]), 0))))> 90)","v":false}]
[null,null,"",null,null,null,null,{"$f":"IF( B88 > $D$83+14, SUMIFS($G$86:G88, $D$86:D88,\"Direct/Indirect/Clinical Administration\", $B$86:B88,\">\"&$D$83 + 14) + ((IF(SUMIF(Table132617209[Type of Care], \"QI\", Table132617209[[Duration ]])>= 4, 4,IF(SUMIF(Table132617209[Type of Care], \"QI\", Table132617209[[Duration ]])<= 3, SUMIF(Table132617209[Type of Care], \"QI\", Table132617209[[Duration ]]), 0))))  > 90, SUMIFS($G$86:G88, $D$86:D88,\"Direct/Indirect/Clinical Administration\",  $B$86:B88,\"<=\"&$D$83 + 14)+ ((IF(SUMIF(Table132617209[Type of Care], \"QI\", Table132617209[[Duration ]])>= 4, 4,IF(SUMIF(Table132617209[Type of Care], \"QI\", Table132617209[[Duration ]])<= 3, SUMIF(Table132617209[Type of Care], \"QI\", Table132617209[[Duration ]]), 0))))> 90)","v":false}]
[null,null,"",null,null,null,null,{"$f":"IF( B89 > $D$83+14, SUMIFS($G$86:G89, $D$86:D89,\"Direct/Indirect/Clinical Administration\", $B$86:B89,\">\"&$D$83 + 14) + ((IF(SUMIF(Table132617209[Type of Care], \"QI\", Table132617209[[Duration ]])>= 4, 4,IF(SUMIF(Table132617209[Type of Care], \"QI\", Table132617209[[Duration ]])<= 3, SUMIF(Table132617209[Type of Care], \"QI\", Table132617209[[Duration ]]), 0))))  > 90, SUMIFS($G$86:G89, $D$86:D89,\"Direct/Indirect/Clinical Administration\",  $B$86:B89,\"<=\"&$D$83 + 14)+ ((IF(SUMIF(Table132617209[Type of Care], \"QI\", Table132617209[[Duration ]])>= 4, 4,IF(SUMIF(Table132617209[Type of Care], \"QI\", Table132617209[[Duration ]])<= 3, SUMIF(Table132617209[Type of Care], \"QI\", Table132617209[[Duration ]]), 0))))> 90)","v":false}]
[null,null,"",null,null,null,null,{"$f":"IF( B90 > $D$83+14, SUMIFS($G$86:G90, $D$86:D90,\"Direct/Indirect/Clinical Administration\", $B$86:B90,\">\"&$D$83 + 14) + ((IF(SUMIF(Table132617209[Type of Care], \"QI\", Table132617209[[Duration ]])>= 4, 4,IF(SUMIF(Table132617209[Type of Care], \"QI\", Table132617209[[Duration ]])<= 3, SUMIF(Table132617209[Type of Care], \"QI\", Table132617209[[Duration ]]), 0))))  > 90, SUMIFS($G$86:G90, $D$86:D90,\"Direct/Indirect/Clinical Administration\",  $B$86:B90,\"<=\"&$D$83 + 14)+ ((IF(SUMIF(Table132617209[Type of Care], \"QI\", Table132617209[[Duration ]])>= 4, 4,IF(SUMIF(Table132617209[Type of Care], \"QI\", Table132617209[[Duration ]])<= 3, SUMIF(Table132617209[Type of Care], \"QI\", Table132617209[[Duration ]]), 0))))> 90)","v":false}]
[null,null,"",null,null,null,null,{"$f":"IF( B91 > $D$83+14, SUMIFS($G$86:G91, $D$86:D91,\"Direct/Indirect/Clinical Administration\", $B$86:B91,\">\"&$D$83 + 14) + ((IF(SUMIF(Table132617209[Type of Care], \"QI\", Table132617209[[Duration ]])>= 4, 4,IF(SUMIF(Table132617209[Type of Care], \"QI\", Table132617209[[Duration ]])<= 3, SUMIF(Table132617209[Type of Care], \"QI\", Table132617209[[Duration ]]), 0))))  > 90, SUMIFS($G$86:G91, $D$86:D91,\"Direct/Indirect/Clinical Administration\",  $B$86:B91,\"<=\"&$D$83 + 14)+ ((IF(SUMIF(Table132617209[Type of Care], \"QI\", Table132617209[[Duration ]])>= 4, 4,IF(SUMIF(Table132617209[Type of Care], \"QI\", Table132617209[[Duration ]])<= 3, SUMIF(Table132617209[Type of Care], \"QI\", Table132617209[[Duration ]]), 0))))> 90)","v":false}]
[null,null,"",null,null,null,null,{"$f":"IF( B92 > $D$83+14, SUMIFS($G$86:G92, $D$86:D92,\"Direct/Indirect/Clinical Administration\", $B$86:B92,\">\"&$D$83 + 14) + ((IF(SUMIF(Table132617209[Type of Care], \"QI\", Table132617209[[Duration ]])>= 4, 4,IF(SUMIF(Table132617209[Type of Care], \"QI\", Table132617209[[Duration ]])<= 3, SUMIF(Table132617209[Type of Care], \"QI\", Table132617209[[Duration ]]), 0))))  > 90, SUMIFS($G$86:G92, $D$86:D92,\"Direct/Indirect/Clinical Administration\",  $B$86:B92,\"<=\"&$D$83 + 14)+ ((IF(SUMIF(Table132617209[Type of Care], \"QI\", Table132617209[[Duration ]])>= 4, 4,IF(SUMIF(Table132617209[Type of Care], \"QI\", Table132617209[[Duration ]])<= 3, SUMIF(Table132617209[Type of Care], \"QI\", Table132617209[[Duration ]]), 0))))> 90)","v":false}]
[null,null,"",null,null,null,null,{"$f":"IF( B93 > $D$83+14, SUMIFS($G$86:G93, $D$86:D93,\"Direct/Indirect/Clinical Administration\", $B$86:B93,\">\"&$D$83 + 14) + ((IF(SUMIF(Table132617209[Type of Care], \"QI\", Table132617209[[Duration ]])>= 4, 4,IF(SUMIF(Table132617209[Type of Care], \"QI\", Table132617209[[Duration ]])<= 3, SUMIF(Table132617209[Type of Care], \"QI\", Table132617209[[Duration ]]), 0))))  > 90, SUMIFS($G$86:G93, $D$86:D93,\"Direct/Indirect/Clinical Administration\",  $B$86:B93,\"<=\"&$D$83 + 14)+ ((IF(SUMIF(Table132617209[Type of Care], \"QI\", Table132617209[[Duration ]])>= 4, 4,IF(SUMIF(Table132617209[Type of Care], \"QI\", Table132617209[[Duration ]])<= 3, SUMIF(Table132617209[Type of Care], \"QI\", Table132617209[[Duration ]]), 0))))> 90)","v":false}]
[null,null,"",null,null,null,null,{"$f":"IF( B94 > $D$83+14, SUMIFS($G$86:G94, $D$86:D94,\"Direct/Indirect/Clinical Administration\", $B$86:B94,\">\"&$D$83 + 14) + ((IF(SUMIF(Table132617209[Type of Care], \"QI\", Table132617209[[Duration ]])>= 4, 4,IF(SUMIF(Table132617209[Type of Care], \"QI\", Table132617209[[Duration ]])<= 3, SUMIF(Table132617209[Type of Care], \"QI\", Table132617209[[Duration ]]), 0))))  > 90, SUMIFS($G$86:G94, $D$86:D94,\"Direct/Indirect/Clinical Administration\",  $B$86:B94,\"<=\"&$D$83 + 14)+ ((IF(SUMIF(Table132617209[Type of Care], \"QI\", Table132617209[[Duration ]])>= 4, 4,IF(SUMIF(Table132617209[Type of Care], \"QI\", Table132617209[[Duration ]])<= 3, SUMIF(Table132617209[Type of Care], \"QI\", Table132617209[[Duration ]]), 0))))> 90)","v":false}]
[null,null,"",null,null,null,null,{"$f":"IF( B95 > $D$83+14, SUMIFS($G$86:G95, $D$86:D95,\"Direct/Indirect/Clinical Administration\", $B$86:B95,\">\"&$D$83 + 14) + ((IF(SUMIF(Table132617209[Type of Care], \"QI\", Table132617209[[Duration ]])>= 4, 4,IF(SUMIF(Table132617209[Type of Care], \"QI\", Table132617209[[Duration ]])<= 3, SUMIF(Table132617209[Type of Care], \"QI\", Table132617209[[Duration ]]), 0))))  > 90, SUMIFS($G$86:G95, $D$86:D95,\"Direct/Indirect/Clinical Administration\",  $B$86:B95,\"<=\"&$D$83 + 14)+ ((IF(SUMIF(Table132617209[Type of Care], \"QI\", Table132617209[[Duration ]])>= 4, 4,IF(SUMIF(Table132617209[Type of Care], \"QI\", Table132617209[[Duration ]])<= 3, SUMIF(Table132617209[Type of Care], \"QI\", Table132617209[[Duration ]]), 0))))> 90)","v":false}]
[null,null,"",null,null,null,null,{"$f":"IF( B96 > $D$83+14, SUMIFS($G$86:G96, $D$86:D96,\"Direct/Indirect/Clinical Administration\", $B$86:B96,\">\"&$D$83 + 14) + ((IF(SUMIF(Table132617209[Type of Care], \"QI\", Table132617209[[Duration ]])>= 4, 4,IF(SUMIF(Table132617209[Type of Care], \"QI\", Table132617209[[Duration ]])<= 3, SUMIF(Table132617209[Type of Care], \"QI\", Table132617209[[Duration ]]), 0))))  > 90, SUMIFS($G$86:G96, $D$86:D96,\"Direct/Indirect/Clinical Administration\",  $B$86:B96,\"<=\"&$D$83 + 14)+ ((IF(SUMIF(Table132617209[Type of Care], \"QI\", Table132617209[[Duration ]])>= 4, 4,IF(SUMIF(Table132617209[Type of Care], \"QI\", Table132617209[[Duration ]])<= 3, SUMIF(Table132617209[Type of Care], \"QI\", Table132617209[[Duration ]]), 0))))> 90)","v":false}]
[null,null,"",null,null,null,null,{"$f":"IF( B97 > $D$83+14, SUMIFS($G$86:G97, $D$86:D97,\"Direct/Indirect/Clinical Administration\", $B$86:B97,\">\"&$D$83 + 14) + ((IF(SUMIF(Table132617209[Type of Care], \"QI\", Table132617209[[Duration ]])>= 4, 4,IF(SUMIF(Table132617209[Type of Care], \"QI\", Table132617209[[Duration ]])<= 3, SUMIF(Table132617209[Type of Care], \"QI\", Table132617209[[Duration ]]), 0))))  > 90, SUMIFS($G$86:G97, $D$86:D97,\"Direct/Indirect/Clinical Administration\",  $B$86:B97,\"<=\"&$D$83 + 14)+ ((IF(SUMIF(Table132617209[Type of Care], \"QI\", Table132617209[[Duration ]])>= 4, 4,IF(SUMIF(Table132617209[Type of Care], \"QI\", Table132617209[[Duration ]])<= 3, SUMIF(Table132617209[Type of Care], \"QI\", Table132617209[[Duration ]]), 0))))> 90)","v":false}]
[null,null,"",null,null,null,null,{"$f":"IF( B98 > $D$83+14, SUMIFS($G$86:G98, $D$86:D98,\"Direct/Indirect/Clinical Administration\", $B$86:B98,\">\"&$D$83 + 14) + ((IF(SUMIF(Table132617209[Type of Care], \"QI\", Table132617209[[Duration ]])>= 4, 4,IF(SUMIF(Table132617209[Type of Care], \"QI\", Table132617209[[Duration ]])<= 3, SUMIF(Table132617209[Type of Care], \"QI\", Table132617209[[Duration ]]), 0))))  > 90, SUMIFS($G$86:G98, $D$86:D98,\"Direct/Indirect/Clinical Administration\",  $B$86:B98,\"<=\"&$D$83 + 14)+ ((IF(SUMIF(Table132617209[Type of Care], \"QI\", Table132617209[[Duration ]])>= 4, 4,IF(SUMIF(Table132617209[Type of Care], \"QI\", Table132617209[[Duration ]])<= 3, SUMIF(Table132617209[Type of Care], \"QI\", Table132617209[[Duration ]]), 0))))> 90)","v":false}]
[null,null,"",null,null,null,null,{"$f":"IF( B99 > $D$83+14, SUMIFS($G$86:G99, $D$86:D99,\"Direct/Indirect/Clinical Administration\", $B$86:B99,\">\"&$D$83 + 14) + ((IF(SUMIF(Table132617209[Type of Care], \"QI\", Table132617209[[Duration ]])>= 4, 4,IF(SUMIF(Table132617209[Type of Care], \"QI\", Table132617209[[Duration ]])<= 3, SUMIF(Table132617209[Type of Care], \"QI\", Table132617209[[Duration ]]), 0))))  > 90, SUMIFS($G$86:G99, $D$86:D99,\"Direct/Indirect/Clinical Administration\",  $B$86:B99,\"<=\"&$D$83 + 14)+ ((IF(SUMIF(Table132617209[Type of Care], \"QI\", Table132617209[[Duration ]])>= 4, 4,IF(SUMIF(Table132617209[Type of Care], \"QI\", Table132617209[[Duration ]])<= 3, SUMIF(Table132617209[Type of Care], \"QI\", Table132617209[[Duration ]]), 0))))> 90)","v":false}]
[null,null,"",null,null,null,null,{"$f":"IF( B100 > $D$83+14, SUMIFS($G$86:G100, $D$86:D100,\"Direct/Indirect/Clinical Administration\", $B$86:B100,\">\"&$D$83 + 14) + ((IF(SUMIF(Table132617209[Type of Care], \"QI\", Table132617209[[Duration ]])>= 4, 4,IF(SUMIF(Table132617209[Type of Care], \"QI\", Table132617209[[Duration ]])<= 3, SUMIF(Table132617209[Type of Care], \"QI\", Table132617209[[Duration ]]), 0))))  > 90, SUMIFS($G$86:G100, $D$86:D100,\"Direct/Indirect/Clinical Administration\",  $B$86:B100,\"<=\"&$D$83 + 14)+ ((IF(SUMIF(Table132617209[Type of Care], \"QI\", Table132617209[[Duration ]])>= 4, 4,IF(SUMIF(Table132617209[Type of Care], \"QI\", Table132617209[[Duration ]])<= 3, SUMIF(Table132617209[Type of Care], \"QI\", Table132617209[[Duration ]]), 0))))> 90)","v":false}]
[null,null,"",null,null,null,null,{"$f":"IF( B101 > $D$83+14, SUMIFS($G$86:G101, $D$86:D101,\"Direct/Indirect/Clinical Administration\", $B$86:B101,\">\"&$D$83 + 14) + ((IF(SUMIF(Table132617209[Type of Care], \"QI\", Table132617209[[Duration ]])>= 4, 4,IF(SUMIF(Table132617209[Type of Care], \"QI\", Table132617209[[Duration ]])<= 3, SUMIF(Table132617209[Type of Care], \"QI\", Table132617209[[Duration ]]), 0))))  > 90, SUMIFS($G$86:G101, $D$86:D101,\"Direct/Indirect/Clinical Administration\",  $B$86:B101,\"<=\"&$D$83 + 14)+ ((IF(SUMIF(Table132617209[Type of Care], \"QI\", Table132617209[[Duration ]])>= 4, 4,IF(SUMIF(Table132617209[Type of Care], \"QI\", Table132617209[[Duration ]])<= 3, SUMIF(Table132617209[Type of Care], \"QI\", Table132617209[[Duration ]]), 0))))> 90)","v":false}]
[null,null,"",null,null,null,null,{"$f":"IF( B102 > $D$83+14, SUMIFS($G$86:G102, $D$86:D102,\"Direct/Indirect/Clinical Administration\", $B$86:B102,\">\"&$D$83 + 14) + ((IF(SUMIF(Table132617209[Type of Care], \"QI\", Table132617209[[Duration ]])>= 4, 4,IF(SUMIF(Table132617209[Type of Care], \"QI\", Table132617209[[Duration ]])<= 3, SUMIF(Table132617209[Type of Care], \"QI\", Table132617209[[Duration ]]), 0))))  > 90, SUMIFS($G$86:G102, $D$86:D102,\"Direct/Indirect/Clinical Administration\",  $B$86:B102,\"<=\"&$D$83 + 14)+ ((IF(SUMIF(Table132617209[Type of Care], \"QI\", Table132617209[[Duration ]])>= 4, 4,IF(SUMIF(Table132617209[Type of Care], \"QI\", Table132617209[[Duration ]])<= 3, SUMIF(Table132617209[Type of Care], \"QI\", Table132617209[[Duration ]]), 0))))> 90)","v":false}]
[null,null,"",null,null,null,null,{"$f":"IF( B103 > $D$83+14, SUMIFS($G$86:G103, $D$86:D103,\"Direct/Indirect/Clinical Administration\", $B$86:B103,\">\"&$D$83 + 14) + ((IF(SUMIF(Table132617209[Type of Care], \"QI\", Table132617209[[Duration ]])>= 4, 4,IF(SUMIF(Table132617209[Type of Care], \"QI\", Table132617209[[Duration ]])<= 3, SUMIF(Table132617209[Type of Care], \"QI\", Table132617209[[Duration ]]), 0))))  > 90, SUMIFS($G$86:G103, $D$86:D103,\"Direct/Indirect/Clinical Administration\",  $B$86:B103,\"<=\"&$D$83 + 14)+ ((IF(SUMIF(Table132617209[Type of Care], \"QI\", Table132617209[[Duration ]])>= 4, 4,IF(SUMIF(Table132617209[Type of Care], \"QI\", Table132617209[[Duration ]])<= 3, SUMIF(Table132617209[Type of Care], \"QI\", Table132617209[[Duration ]]), 0))))> 90)","v":false}]
[null,null,"",null,null,null,null,{"$f":"IF( B104 > $D$83+14, SUMIFS($G$86:G104, $D$86:D104,\"Direct/Indirect/Clinical Administration\", $B$86:B104,\">\"&$D$83 + 14) + ((IF(SUMIF(Table132617209[Type of Care], \"QI\", Table132617209[[Duration ]])>= 4, 4,IF(SUMIF(Table132617209[Type of Care], \"QI\", Table132617209[[Duration ]])<= 3, SUMIF(Table132617209[Type of Care], \"QI\", Table132617209[[Duration ]]), 0))))  > 90, SUMIFS($G$86:G104, $D$86:D104,\"Direct/Indirect/Clinical Administration\",  $B$86:B104,\"<=\"&$D$83 + 14)+ ((IF(SUMIF(Table132617209[Type of Care], \"QI\", Table132617209[[Duration ]])>= 4, 4,IF(SUMIF(Table132617209[Type of Care], \"QI\", Table132617209[[Duration ]])<= 3, SUMIF(Table132617209[Type of Care], \"QI\", Table132617209[[Duration ]]), 0))))> 90)","v":false}]
[null,null,"",null,null,null,null,{"$f":"IF( B105 > $D$83+14, SUMIFS($G$86:G105, $D$86:D105,\"Direct/Indirect/Clinical Administration\", $B$86:B105,\">\"&$D$83 + 14) + ((IF(SUMIF(Table132617209[Type of Care], \"QI\", Table132617209[[Duration ]])>= 4, 4,IF(SUMIF(Table132617209[Type of Care], \"QI\", Table132617209[[Duration ]])<= 3, SUMIF(Table132617209[Type of Care], \"QI\", Table132617209[[Duration ]]), 0))))  > 90, SUMIFS($G$86:G105, $D$86:D105,\"Direct/Indirect/Clinical Administration\",  $B$86:B105,\"<=\"&$D$83 + 14)+ ((IF(SUMIF(Table132617209[Type of Care], \"QI\", Table132617209[[Duration ]])>= 4, 4,IF(SUMIF(Table132617209[Type of Care], \"QI\", Table132617209[[Duration ]])<= 3, SUMIF(Table132617209[Type of Care], \"QI\", Table132617209[[Duration ]]), 0))))> 90)","v":false}]
[null,null,"",null,null,null,null,{"$f":"IF( B106 > $D$83+14, SUMIFS($G$86:G106, $D$86:D106,\"Direct/Indirect/Clinical Administration\", $B$86:B106,\">\"&$D$83 + 14) + ((IF(SUMIF(Table132617209[Type of Care], \"QI\", Table132617209[[Duration ]])>= 4, 4,IF(SUMIF(Table132617209[Type of Care], \"QI\", Table132617209[[Duration ]])<= 3, SUMIF(Table132617209[Type of Care], \"QI\", Table132617209[[Duration ]]), 0))))  > 90, SUMIFS($G$86:G106, $D$86:D106,\"Direct/Indirect/Clinical Administration\",  $B$86:B106,\"<=\"&$D$83 + 14)+ ((IF(SUMIF(Table132617209[Type of Care], \"QI\", Table132617209[[Duration ]])>= 4, 4,IF(SUMIF(Table132617209[Type of Care], \"QI\", Table132617209[[Duration ]])<= 3, SUMIF(Table132617209[Type of Care], \"QI\", Table132617209[[Duration ]]), 0))))> 90)","v":false}]
[null,null,"",null,null,null,null,{"$f":"IF( B107 > $D$83+14, SUMIFS($G$86:G107, $D$86:D107,\"Direct/Indirect/Clinical Administration\", $B$86:B107,\">\"&$D$83 + 14) + ((IF(SUMIF(Table132617209[Type of Care], \"QI\", Table132617209[[Duration ]])>= 4, 4,IF(SUMIF(Table132617209[Type of Care], \"QI\", Table132617209[[Duration ]])<= 3, SUMIF(Table132617209[Type of Care], \"QI\", Table132617209[[Duration ]]), 0))))  > 90, SUMIFS($G$86:G107, $D$86:D107,\"Direct/Indirect/Clinical Administration\",  $B$86:B107,\"<=\"&$D$83 + 14)+ ((IF(SUMIF(Table132617209[Type of Care], \"QI\", Table132617209[[Duration ]])>= 4, 4,IF(SUMIF(Table132617209[Type of Care], \"QI\", Table132617209[[Duration ]])<= 3, SUMIF(Table132617209[Type of Care], \"QI\", Table132617209[[Duration ]]), 0))))> 90)","v":false}]
[null,null,"",null,null,null,null,{"$f":"IF( B108 > $D$83+14, SUMIFS($G$86:G108, $D$86:D108,\"Direct/Indirect/Clinical Administration\", $B$86:B108,\">\"&$D$83 + 14) + ((IF(SUMIF(Table132617209[Type of Care], \"QI\", Table132617209[[Duration ]])>= 4, 4,IF(SUMIF(Table132617209[Type of Care], \"QI\", Table132617209[[Duration ]])<= 3, SUMIF(Table132617209[Type of Care], \"QI\", Table132617209[[Duration ]]), 0))))  > 90, SUMIFS($G$86:G108, $D$86:D108,\"Direct/Indirect/Clinical Administration\",  $B$86:B108,\"<=\"&$D$83 + 14)+ ((IF(SUMIF(Table132617209[Type of Care], \"QI\", Table132617209[[Duration ]])>= 4, 4,IF(SUMIF(Table132617209[Type of Care], \"QI\", Table132617209[[Duration ]])<= 3, SUMIF(Table132617209[Type of Care], \"QI\", Table132617209[[Duration ]]), 0))))> 90)","v":false}]
[null,null,"",null,null,null,null,{"$f":"IF( B109 > $D$83+14, SUMIFS($G$86:G109, $D$86:D109,\"Direct/Indirect/Clinical Administration\", $B$86:B109,\">\"&$D$83 + 14) + ((IF(SUMIF(Table132617209[Type of Care], \"QI\", Table132617209[[Duration ]])>= 4, 4,IF(SUMIF(Table132617209[Type of Care], \"QI\", Table132617209[[Duration ]])<= 3, SUMIF(Table132617209[Type of Care], \"QI\", Table132617209[[Duration ]]), 0))))  > 90, SUMIFS($G$86:G109, $D$86:D109,\"Direct/Indirect/Clinical Administration\",  $B$86:B109,\"<=\"&$D$83 + 14)+ ((IF(SUMIF(Table132617209[Type of Care], \"QI\", Table132617209[[Duration ]])>= 4, 4,IF(SUMIF(Table132617209[Type of Care], \"QI\", Table132617209[[Duration ]])<= 3, SUMIF(Table132617209[Type of Care], \"QI\", Table132617209[[Duration ]]), 0))))> 90)","v":false}]
[null,null,"",null,null,null,null,{"$f":"IF( B110 > $D$83+14, SUMIFS($G$86:G110, $D$86:D110,\"Direct/Indirect/Clinical Administration\", $B$86:B110,\">\"&$D$83 + 14) + ((IF(SUMIF(Table132617209[Type of Care], \"QI\", Table132617209[[Duration ]])>= 4, 4,IF(SUMIF(Table132617209[Type of Care], \"QI\", Table132617209[[Duration ]])<= 3, SUMIF(Table132617209[Type of Care], \"QI\", Table132617209[[Duration ]]), 0))))  > 90, SUMIFS($G$86:G110, $D$86:D110,\"Direct/Indirect/Clinical Administration\",  $B$86:B110,\"<=\"&$D$83 + 14)+ ((IF(SUMIF(Table132617209[Type of Care], \"QI\", Table132617209[[Duration ]])>= 4, 4,IF(SUMIF(Table132617209[Type of Care], \"QI\", Table132617209[[Duration ]])<= 3, SUMIF(Table132617209[Type of Care], \"QI\", Table132617209[[Duration ]]), 0))))> 90)","v":false}]
[null,null,"",null,null,null,null,{"$f":"IF( B111 > $D$83+14, SUMIFS($G$86:G111, $D$86:D111,\"Direct/Indirect/Clinical Administration\", $B$86:B111,\">\"&$D$83 + 14) + ((IF(SUMIF(Table132617209[Type of Care], \"QI\", Table132617209[[Duration ]])>= 4, 4,IF(SUMIF(Table132617209[Type of Care], \"QI\", Table132617209[[Duration ]])<= 3, SUMIF(Table132617209[Type of Care], \"QI\", Table132617209[[Duration ]]), 0))))  > 90, SUMIFS($G$86:G111, $D$86:D111,\"Direct/Indirect/Clinical Administration\",  $B$86:B111,\"<=\"&$D$83 + 14)+ ((IF(SUMIF(Table132617209[Type of Care], \"QI\", Table132617209[[Duration ]])>= 4, 4,IF(SUMIF(Table132617209[Type of Care], \"QI\", Table132617209[[Duration ]])<= 3, SUMIF(Table132617209[Type of Care], \"QI\", Table132617209[[Duration ]]), 0))))> 90)","v":false}]
[null,null,"",null,null,null,null,{"$f":"IF( B112 > $D$83+14, SUMIFS($G$86:G112, $D$86:D112,\"Direct/Indirect/Clinical Administration\", $B$86:B112,\">\"&$D$83 + 14) + ((IF(SUMIF(Table132617209[Type of Care], \"QI\", Table132617209[[Duration ]])>= 4, 4,IF(SUMIF(Table132617209[Type of Care], \"QI\", Table132617209[[Duration ]])<= 3, SUMIF(Table132617209[Type of Care], \"QI\", Table132617209[[Duration ]]), 0))))  > 90, SUMIFS($G$86:G112, $D$86:D112,\"Direct/Indirect/Clinical Administration\",  $B$86:B112,\"<=\"&$D$83 + 14)+ ((IF(SUMIF(Table132617209[Type of Care], \"QI\", Table132617209[[Duration ]])>= 4, 4,IF(SUMIF(Table132617209[Type of Care], \"QI\", Table132617209[[Duration ]])<= 3, SUMIF(Table132617209[Type of Care], \"QI\", Table132617209[[Duration ]]), 0))))> 90)","v":false}]
[null,null,"",null,null,null,null,{"$f":"IF( B113 > $D$83+14, SUMIFS($G$86:G113, $D$86:D113,\"Direct/Indirect/Clinical Administration\", $B$86:B113,\">\"&$D$83 + 14) + ((IF(SUMIF(Table132617209[Type of Care], \"QI\", Table132617209[[Duration ]])>= 4, 4,IF(SUMIF(Table132617209[Type of Care], \"QI\", Table132617209[[Duration ]])<= 3, SUMIF(Table132617209[Type of Care], \"QI\", Table132617209[[Duration ]]), 0))))  > 90, SUMIFS($G$86:G113, $D$86:D113,\"Direct/Indirect/Clinical Administration\",  $B$86:B113,\"<=\"&$D$83 + 14)+ ((IF(SUMIF(Table132617209[Type of Care], \"QI\", Table132617209[[Duration ]])>= 4, 4,IF(SUMIF(Table132617209[Type of Care], \"QI\", Table132617209[[Duration ]])<= 3, SUMIF(Table132617209[Type of Care], \"QI\", Table132617209[[Duration ]]), 0))))> 90)","v":false}]
[null,null,"",null,null,null,null,{"$f":"IF( B114 > $D$83+14, SUMIFS($G$86:G114, $D$86:D114,\"Direct/Indirect/Clinical Administration\", $B$86:B114,\">\"&$D$83 + 14) + ((IF(SUMIF(Table132617209[Type of Care], \"QI\", Table132617209[[Duration ]])>= 4, 4,IF(SUMIF(Table132617209[Type of Care], \"QI\", Table132617209[[Duration ]])<= 3, SUMIF(Table132617209[Type of Care], \"QI\", Table132617209[[Duration ]]), 0))))  > 90, SUMIFS($G$86:G114, $D$86:D114,\"Direct/Indirect/Clinical Administration\",  $B$86:B114,\"<=\"&$D$83 + 14)+ ((IF(SUMIF(Table132617209[Type of Care], \"QI\", Table132617209[[Duration ]])>= 4, 4,IF(SUMIF(Table132617209[Type of Care], \"QI\", Table132617209[[Duration ]])<= 3, SUMIF(Table132617209[Type of Care], \"QI\", Table132617209[[Duration ]]), 0))))> 90)","v":false}]
[null,null,{"$f":"IF(B115=\"\", \"\", B115)","v":""},null,null,"Total Contract Hours",{"$f":"(SUMIF(Table132617209[Type of Care], \"Direct/Indirect/Clinical Administration\",Table132617209[[Duration ]]))","v":0},"CT3"]
[null,null,null,null,null,"Total Included QI Hours",{"$f":"(IF(SUMIF(Table132617209[Type of Care], \"QI\", Table132617209[[Duration ]])>= 4, 4,IF(SUMIF(Table132617209[Type of Care], \"QI\", Table132617209[[Duration ]])<= 3, SUMIF(Table132617209[Type of Care], \"QI\", Table132617209[[Duration ]]), 0)))","v":0},"QI3"]
[null,null,null,null,null,"Total Excluded Hours",{"$f":"G118+G119","v":0},"EX3"]
[null,null,null,null,null,"         Excluded Contract Hours",{"$f":"(SUMIF(Table132617209[Type of Care], \"Third Party/Specialist FFS\",Table132617209[[Duration ]])) + (SUMIF(Table132617209[Type of Care], \"Break (>15 Minutes)\", Table132617209[[Duration ]]))","v":0},"EXC3"]
[null,null,null,null,null,"      Excluded QI Hours",{"$f":"(SUMIF(Table132617209[Type of Care], \"QI\", Table132617209[[Duration ]]) - (IF(SUMIF(Table132617209[Type of Care], \"QI\", Table132617209[[Duration ]])>= 4, 4,IF(SUMIF(Table132617209[Type of Care], \"QI\", Table132617209[[Duration ]])<= 3, SUMIF(Table132617209[Type of Care], \"QI\", Table132617209[[Duration ]]), 0))))","v":0},"EXQI3"]
[null,null,{"$f":"IF(B120=\"\", \"\", B120)","v":""},null,null,"Hours Above 90hr/semi-monthly",{"$f":"  (IF(SUMIFS(Table132617209[[Duration ]],Table132617209[Date (YYYY-MM-DD)], \">\"&$D$83+14, Table132617209[Type of Care], \"Direct/Indirect/Clinical Administration\")>= 90, (SUMIFS(Table132617209[[Duration ]],Table132617209[Date (YYYY-MM-DD)], \">\"&$D$83+14, Table132617209[Type of Care], \"Direct/Indirect/Clinical Administration\")+ (IF(SUMIF(Table132617209[Type of Care], \"QI\", Table132617209[[Duration ]])>= 4, 4,IF(SUMIF(Table132617209[Type of Care], \"QI\", Table132617209[[Duration ]])<= 3, SUMIF(Table132617209[Type of Care], \"QI\",Table132617209[[Duration ]]), 0))) -90))) + (IF(SUMIFS(Table132617209[[Duration ]],Table132617209[Date (YYYY-MM-DD)], \"<=\"&$D$83+14, Table132617209[Type of Care], \"Direct/Indirect/Clinical Administration\")>= 90, (SUMIFS(Table132617209[[Duration ]],Table132617209[Date (YYYY-MM-DD)], \"<=\"&$D$83+14, Table132617209[Type of Care], \"Direct/Indirect/Clinical Administration\")+ (IF(SUMIF(Table132617209[Type of Care], \"QI\", Table132617209[[Duration ]])>= 4, 4,IF(SUMIF(Table132617209[Type of Care], \"QI\", Table132617209[[Duration ]])<= 3, SUMIF(Table132617209[Type of Care], \"QI\",Table132617209[[Duration ]]), 0))) -90)))","v":0},"A903"]

{"sheet":"Physician 5","index":5,"n_rows":120,"n_cols":8,"rows_kept":120,"cut":false,"hidden":false,"merged":[]}
[]
[null,"[Physician Name]"]
[null,"Practitioner #:",0]
[null,"Annual Rate: ",0]
[null,"Qrt. Disbursement: ",0]
[null,null,"Jan - Mar"]
[null,"Total Contract \nHours","Total Included \nQI Hours","Excluded Contract \nHours"]
[null,{"$f":"G35+G75+G115","v":0},{"$f":"G36+G76+G116","v":0},{"$f":"G37+G77+G117","v":0},null,null,null,"Totals"]
[]
[null,{"$f":"IF(Clinic!C5=\"Jan - Mar\", \"January\", IF(Clinic!C5= \"Apr - June\", \"April\", IF(Clinic!C5=\"July - Sept\", \"July\", IF(Clinic!C5=\" Oct - Dec\", \"October\"))))","v":"January"},{"$f":"Clinic!C6","v":2021},{"$f":"DATE(YEAR(B13),MONTH(DATEVALUE(B10&\"1\")),1)","v":"1900-01-01"},null,null,null,"Month1"]
[]
[null,"Date (YYYY-MM-DD)","Day ","Type of Care","Start Time AM/PM","End Time AM/PM","Duration","FALSE/TRUE"]
[null,null,{"$f":"IF(B13=\"\", \"\", B13)","v":""},null,null,null,null,{"$f":"IF( B13 > $D$10+14, SUMIFS($G$13:G13, $D$13:D13,\"Direct/Indirect/Clinical Administration\", $B$13:B13,\">\"&$D$10 + 14) + ((IF(SUMIF(Table131518710[Type of Care], \"QI\", Table131518710[Duration])>= 4, 4,IF(SUMIF(Table131518710[Type of Care], \"QI\", Table131518710[Duration])<= 3, SUMIF(Table131518710[Type of Care], \"QI\", Table131518710[Duration]), 0))))  > 90, SUMIFS($G$13:G13, $D$13:D13,\"Direct/Indirect/Clinical Administration\",  $B$13:B13,\"<=\"&$D$10 + 14)+ ((IF(SUMIF(Table131518710[Type of Care], \"QI\", Table131518710[Duration])>= 4, 4,IF(SUMIF(Table131518710[Type of Care], \"QI\", Table131518710[Duration])<= 3, SUMIF(Table131518710[Type of Care], \"QI\", Table131518710[Duration]), 0))))> 90)","v":false}]
[null,null,{"$f":"IF(B14=\"\", \"\", B14)","v":""},null,null,null,null,{"$f":"IF( B14 > $D$10+14, SUMIFS($G$13:G14, $D$13:D14,\"Direct/Indirect/Clinical Administration\", $B$13:B14,\">\"&$D$10 + 14) + ((IF(SUMIF(Table131518710[Type of Care], \"QI\", Table131518710[Duration])>= 4, 4,IF(SUMIF(Table131518710[Type of Care], \"QI\", Table131518710[Duration])<= 3, SUMIF(Table131518710[Type of Care], \"QI\", Table131518710[Duration]), 0))))  > 90, SUMIFS($G$13:G14, $D$13:D14,\"Direct/Indirect/Clinical Administration\",  $B$13:B14,\"<=\"&$D$10 + 14)+ ((IF(SUMIF(Table131518710[Type of Care], \"QI\", Table131518710[Duration])>= 4, 4,IF(SUMIF(Table131518710[Type of Care], \"QI\", Table131518710[Duration])<= 3, SUMIF(Table131518710[Type of Care], \"QI\", Table131518710[Duration]), 0))))> 90)","v":false}]
[null,null,"",null,null,null,null,{"$f":"IF( B15 > $D$10+14, SUMIFS($G$13:G15, $D$13:D15,\"Direct/Indirect/Clinical Administration\", $B$13:B15,\">\"&$D$10 + 14) + ((IF(SUMIF(Table131518710[Type of Care], \"QI\", Table131518710[Duration])>= 4, 4,IF(SUMIF(Table131518710[Type of Care], \"QI\", Table131518710[Duration])<= 3, SUMIF(Table131518710[Type of Care], \"QI\", Table131518710[Duration]), 0))))  > 90, SUMIFS($G$13:G15, $D$13:D15,\"Direct/Indirect/Clinical Administration\",  $B$13:B15,\"<=\"&$D$10 + 14)+ ((IF(SUMIF(Table131518710[Type of Care], \"QI\", Table131518710[Duration])>= 4, 4,IF(SUMIF(Table131518710[Type of Care], \"QI\", Table131518710[Duration])<= 3, SUMIF(Table131518710[Type of Care], \"QI\", Table131518710[Duration]), 0))))> 90)","v":false}]
[null,null,"",null,null,null,null,{"$f":"IF( B16 > $D$10+14, SUMIFS($G$13:G16, $D$13:D16,\"Direct/Indirect/Clinical Administration\", $B$13:B16,\">\"&$D$10 + 14) + ((IF(SUMIF(Table131518710[Type of Care], \"QI\", Table131518710[Duration])>= 4, 4,IF(SUMIF(Table131518710[Type of Care], \"QI\", Table131518710[Duration])<= 3, SUMIF(Table131518710[Type of Care], \"QI\", Table131518710[Duration]), 0))))  > 90, SUMIFS($G$13:G16, $D$13:D16,\"Direct/Indirect/Clinical Administration\",  $B$13:B16,\"<=\"&$D$10 + 14)+ ((IF(SUMIF(Table131518710[Type of Care], \"QI\", Table131518710[Duration])>= 4, 4,IF(SUMIF(Table131518710[Type of Care], \"QI\", Table131518710[Duration])<= 3, SUMIF(Table131518710[Type of Care], \"QI\", Table131518710[Duration]), 0))))> 90)","v":false}]
[null,null,"",null,null,null,null,{"$f":"IF( B17 > $D$10+14, SUMIFS($G$13:G17, $D$13:D17,\"Direct/Indirect/Clinical Administration\", $B$13:B17,\">\"&$D$10 + 14) + ((IF(SUMIF(Table131518710[Type of Care], \"QI\", Table131518710[Duration])>= 4, 4,IF(SUMIF(Table131518710[Type of Care], \"QI\", Table131518710[Duration])<= 3, SUMIF(Table131518710[Type of Care], \"QI\", Table131518710[Duration]), 0))))  > 90, SUMIFS($G$13:G17, $D$13:D17,\"Direct/Indirect/Clinical Administration\",  $B$13:B17,\"<=\"&$D$10 + 14)+ ((IF(SUMIF(Table131518710[Type of Care], \"QI\", Table131518710[Duration])>= 4, 4,IF(SUMIF(Table131518710[Type of Care], \"QI\", Table131518710[Duration])<= 3, SUMIF(Table131518710[Type of Care], \"QI\", Table131518710[Duration]), 0))))> 90)","v":false}]
[null,null,"",null,null,null,null,{"$f":"IF( B18 > $D$10+14, SUMIFS($G$13:G18, $D$13:D18,\"Direct/Indirect/Clinical Administration\", $B$13:B18,\">\"&$D$10 + 14) + ((IF(SUMIF(Table131518710[Type of Care], \"QI\", Table131518710[Duration])>= 4, 4,IF(SUMIF(Table131518710[Type of Care], \"QI\", Table131518710[Duration])<= 3, SUMIF(Table131518710[Type of Care], \"QI\", Table131518710[Duration]), 0))))  > 90, SUMIFS($G$13:G18, $D$13:D18,\"Direct/Indirect/Clinical Administration\",  $B$13:B18,\"<=\"&$D$10 + 14)+ ((IF(SUMIF(Table131518710[Type of Care], \"QI\", Table131518710[Duration])>= 4, 4,IF(SUMIF(Table131518710[Type of Care], \"QI\", Table131518710[Duration])<= 3, SUMIF(Table131518710[Type of Care], \"QI\", Table131518710[Duration]), 0))))> 90)","v":false}]
[null,null,"",null,null,null,null,{"$f":"IF( B19 > $D$10+14, SUMIFS($G$13:G19, $D$13:D19,\"Direct/Indirect/Clinical Administration\", $B$13:B19,\">\"&$D$10 + 14) + ((IF(SUMIF(Table131518710[Type of Care], \"QI\", Table131518710[Duration])>= 4, 4,IF(SUMIF(Table131518710[Type of Care], \"QI\", Table131518710[Duration])<= 3, SUMIF(Table131518710[Type of Care], \"QI\", Table131518710[Duration]), 0))))  > 90, SUMIFS($G$13:G19, $D$13:D19,\"Direct/Indirect/Clinical Administration\",  $B$13:B19,\"<=\"&$D$10 + 14)+ ((IF(SUMIF(Table131518710[Type of Care], \"QI\", Table131518710[Duration])>= 4, 4,IF(SUMIF(Table131518710[Type of Care], \"QI\", Table131518710[Duration])<= 3, SUMIF(Table131518710[Type of Care], \"QI\", Table131518710[Duration]), 0))))> 90)","v":false}]
[null,null,"",null,null,null,null,{"$f":"IF( B20 > $D$10+14, SUMIFS($G$13:G20, $D$13:D20,\"Direct/Indirect/Clinical Administration\", $B$13:B20,\">\"&$D$10 + 14) + ((IF(SUMIF(Table131518710[Type of Care], \"QI\", Table131518710[Duration])>= 4, 4,IF(SUMIF(Table131518710[Type of Care], \"QI\", Table131518710[Duration])<= 3, SUMIF(Table131518710[Type of Care], \"QI\", Table131518710[Duration]), 0))))  > 90, SUMIFS($G$13:G20, $D$13:D20,\"Direct/Indirect/Clinical Administration\",  $B$13:B20,\"<=\"&$D$10 + 14)+ ((IF(SUMIF(Table131518710[Type of Care], \"QI\", Table131518710[Duration])>= 4, 4,IF(SUMIF(Table131518710[Type of Care], \"QI\", Table131518710[Duration])<= 3, SUMIF(Table131518710[Type of Care], \"QI\", Table131518710[Duration]), 0))))> 90)","v":false}]
[null,null,"",null,null,null,null,{"$f":"IF( B21 > $D$10+14, SUMIFS($G$13:G21, $D$13:D21,\"Direct/Indirect/Clinical Administration\", $B$13:B21,\">\"&$D$10 + 14) + ((IF(SUMIF(Table131518710[Type of Care], \"QI\", Table131518710[Duration])>= 4, 4,IF(SUMIF(Table131518710[Type of Care], \"QI\", Table131518710[Duration])<= 3, SUMIF(Table131518710[Type of Care], \"QI\", Table131518710[Duration]), 0))))  > 90, SUMIFS($G$13:G21, $D$13:D21,\"Direct/Indirect/Clinical Administration\",  $B$13:B21,\"<=\"&$D$10 + 14)+ ((IF(SUMIF(Table131518710[Type of Care], \"QI\", Table131518710[Duration])>= 4, 4,IF(SUMIF(Table131518710[Type of Care], \"QI\", Table131518710[Duration])<= 3, SUMIF(Table131518710[Type of Care], \"QI\", Table131518710[Duration]), 0))))> 90)","v":false}]
[null,null,"",null,null,null,null,{"$f":"IF( B22 > $D$10+14, SUMIFS($G$13:G22, $D$13:D22,\"Direct/Indirect/Clinical Administration\", $B$13:B22,\">\"&$D$10 + 14) + ((IF(SUMIF(Table131518710[Type of Care], \"QI\", Table131518710[Duration])>= 4, 4,IF(SUMIF(Table131518710[Type of Care], \"QI\", Table131518710[Duration])<= 3, SUMIF(Table131518710[Type of Care], \"QI\", Table131518710[Duration]), 0))))  > 90, SUMIFS($G$13:G22, $D$13:D22,\"Direct/Indirect/Clinical Administration\",  $B$13:B22,\"<=\"&$D$10 + 14)+ ((IF(SUMIF(Table131518710[Type of Care], \"QI\", Table131518710[Duration])>= 4, 4,IF(SUMIF(Table131518710[Type of Care], \"QI\", Table131518710[Duration])<= 3, SUMIF(Table131518710[Type of Care], \"QI\", Table131518710[Duration]), 0))))> 90)","v":false}]
[null,null,"",null,null,null,null,{"$f":"IF( B23 > $D$10+14, SUMIFS($G$13:G23, $D$13:D23,\"Direct/Indirect/Clinical Administration\", $B$13:B23,\">\"&$D$10 + 14) + ((IF(SUMIF(Table131518710[Type of Care], \"QI\", Table131518710[Duration])>= 4, 4,IF(SUMIF(Table131518710[Type of Care], \"QI\", Table131518710[Duration])<= 3, SUMIF(Table131518710[Type of Care], \"QI\", Table131518710[Duration]), 0))))  > 90, SUMIFS($G$13:G23, $D$13:D23,\"Direct/Indirect/Clinical Administration\",  $B$13:B23,\"<=\"&$D$10 + 14)+ ((IF(SUMIF(Table131518710[Type of Care], \"QI\", Table131518710[Duration])>= 4, 4,IF(SUMIF(Table131518710[Type of Care], \"QI\", Table131518710[Duration])<= 3, SUMIF(Table131518710[Type of Care], \"QI\", Table131518710[Duration]), 0))))> 90)","v":false}]
[null,null,"",null,null,null,null,{"$f":"IF( B24 > $D$10+14, SUMIFS($G$13:G24, $D$13:D24,\"Direct/Indirect/Clinical Administration\", $B$13:B24,\">\"&$D$10 + 14) + ((IF(SUMIF(Table131518710[Type of Care], \"QI\", Table131518710[Duration])>= 4, 4,IF(SUMIF(Table131518710[Type of Care], \"QI\", Table131518710[Duration])<= 3, SUMIF(Table131518710[Type of Care], \"QI\", Table131518710[Duration]), 0))))  > 90, SUMIFS($G$13:G24, $D$13:D24,\"Direct/Indirect/Clinical Administration\",  $B$13:B24,\"<=\"&$D$10 + 14)+ ((IF(SUMIF(Table131518710[Type of Care], \"QI\", Table131518710[Duration])>= 4, 4,IF(SUMIF(Table131518710[Type of Care], \"QI\", Table131518710[Duration])<= 3, SUMIF(Table131518710[Type of Care], \"QI\", Table131518710[Duration]), 0))))> 90)","v":false}]
[null,null,"",null,null,null,null,{"$f":"IF( B25 > $D$10+14, SUMIFS($G$13:G25, $D$13:D25,\"Direct/Indirect/Clinical Administration\", $B$13:B25,\">\"&$D$10 + 14) + ((IF(SUMIF(Table131518710[Type of Care], \"QI\", Table131518710[Duration])>= 4, 4,IF(SUMIF(Table131518710[Type of Care], \"QI\", Table131518710[Duration])<= 3, SUMIF(Table131518710[Type of Care], \"QI\", Table131518710[Duration]), 0))))  > 90, SUMIFS($G$13:G25, $D$13:D25,\"Direct/Indirect/Clinical Administration\",  $B$13:B25,\"<=\"&$D$10 + 14)+ ((IF(SUMIF(Table131518710[Type of Care], \"QI\", Table131518710[Duration])>= 4, 4,IF(SUMIF(Table131518710[Type of Care], \"QI\", Table131518710[Duration])<= 3, SUMIF(Table131518710[Type of Care], \"QI\", Table131518710[Duration]), 0))))> 90)","v":false}]
[null,null,"",null,null,null,null,{"$f":"IF( B26 > $D$10+14, SUMIFS($G$13:G26, $D$13:D26,\"Direct/Indirect/Clinical Administration\", $B$13:B26,\">\"&$D$10 + 14) + ((IF(SUMIF(Table131518710[Type of Care], \"QI\", Table131518710[Duration])>= 4, 4,IF(SUMIF(Table131518710[Type of Care], \"QI\", Table131518710[Duration])<= 3, SUMIF(Table131518710[Type of Care], \"QI\", Table131518710[Duration]), 0))))  > 90, SUMIFS($G$13:G26, $D$13:D26,\"Direct/Indirect/Clinical Administration\",  $B$13:B26,\"<=\"&$D$10 + 14)+ ((IF(SUMIF(Table131518710[Type of Care], \"QI\", Table131518710[Duration])>= 4, 4,IF(SUMIF(Table131518710[Type of Care], \"QI\", Table131518710[Duration])<= 3, SUMIF(Table131518710[Type of Care], \"QI\", Table131518710[Duration]), 0))))> 90)","v":false}]
[null,null,"",null,null,null,null,{"$f":"IF( B27 > $D$10+14, SUMIFS($G$13:G27, $D$13:D27,\"Direct/Indirect/Clinical Administration\", $B$13:B27,\">\"&$D$10 + 14) + ((IF(SUMIF(Table131518710[Type of Care], \"QI\", Table131518710[Duration])>= 4, 4,IF(SUMIF(Table131518710[Type of Care], \"QI\", Table131518710[Duration])<= 3, SUMIF(Table131518710[Type of Care], \"QI\", Table131518710[Duration]), 0))))  > 90, SUMIFS($G$13:G27, $D$13:D27,\"Direct/Indirect/Clinical Administration\",  $B$13:B27,\"<=\"&$D$10 + 14)+ ((IF(SUMIF(Table131518710[Type of Care], \"QI\", Table131518710[Duration])>= 4, 4,IF(SUMIF(Table131518710[Type of Care], \"QI\", Table131518710[Duration])<= 3, SUMIF(Table131518710[Type of Care], \"QI\", Table131518710[Duration]), 0))))> 90)","v":false}]
[null,null,"",null,null,null,null,{"$f":"IF( B28 > $D$10+14, SUMIFS($G$13:G28, $D$13:D28,\"Direct/Indirect/Clinical Administration\", $B$13:B28,\">\"&$D$10 + 14) + ((IF(SUMIF(Table131518710[Type of Care], \"QI\", Table131518710[Duration])>= 4, 4,IF(SUMIF(Table131518710[Type of Care], \"QI\", Table131518710[Duration])<= 3, SUMIF(Table131518710[Type of Care], \"QI\", Table131518710[Duration]), 0))))  > 90, SUMIFS($G$13:G28, $D$13:D28,\"Direct/Indirect/Clinical Administration\",  $B$13:B28,\"<=\"&$D$10 + 14)+ ((IF(SUMIF(Table131518710[Type of Care], \"QI\", Table131518710[Duration])>= 4, 4,IF(SUMIF(Table131518710[Type of Care], \"QI\", Table131518710[Duration])<= 3, SUMIF(Table131518710[Type of Care], \"QI\", Table131518710[Duration]), 0))))> 90)","v":false}]
[null,null,"",null,null,null,null,{"$f":"IF( B29 > $D$10+14, SUMIFS($G$13:G29, $D$13:D29,\"Direct/Indirect/Clinical Administration\", $B$13:B29,\">\"&$D$10 + 14) + ((IF(SUMIF(Table131518710[Type of Care], \"QI\", Table131518710[Duration])>= 4, 4,IF(SUMIF(Table131518710[Type of Care], \"QI\", Table131518710[Duration])<= 3, SUMIF(Table131518710[Type of Care], \"QI\", Table131518710[Duration]), 0))))  > 90, SUMIFS($G$13:G29, $D$13:D29,\"Direct/Indirect/Clinical Administration\",  $B$13:B29,\"<=\"&$D$10 + 14)+ ((IF(SUMIF(Table131518710[Type of Care], \"QI\", Table131518710[Duration])>= 4, 4,IF(SUMIF(Table131518710[Type of Care], \"QI\", Table131518710[Duration])<= 3, SUMIF(Table131518710[Type of Care], \"QI\", Table131518710[Duration]), 0))))> 90)","v":false}]
[null,null,"",null,null,null,null,{"$f":"IF( B30 > $D$10+14, SUMIFS($G$13:G30, $D$13:D30,\"Direct/Indirect/Clinical Administration\", $B$13:B30,\">\"&$D$10 + 14) + ((IF(SUMIF(Table131518710[Type of Care], \"QI\", Table131518710[Duration])>= 4, 4,IF(SUMIF(Table131518710[Type of Care], \"QI\", Table131518710[Duration])<= 3, SUMIF(Table131518710[Type of Care], \"QI\", Table131518710[Duration]), 0))))  > 90, SUMIFS($G$13:G30, $D$13:D30,\"Direct/Indirect/Clinical Administration\",  $B$13:B30,\"<=\"&$D$10 + 14)+ ((IF(SUMIF(Table131518710[Type of Care], \"QI\", Table131518710[Duration])>= 4, 4,IF(SUMIF(Table131518710[Type of Care], \"QI\", Table131518710[Duration])<= 3, SUMIF(Table131518710[Type of Care], \"QI\", Table131518710[Duration]), 0))))> 90)","v":false}]
[null,null,"",null,null,null,null,{"$f":"IF( B31 > $D$10+14, SUMIFS($G$13:G31, $D$13:D31,\"Direct/Indirect/Clinical Administration\", $B$13:B31,\">\"&$D$10 + 14) + ((IF(SUMIF(Table131518710[Type of Care], \"QI\", Table131518710[Duration])>= 4, 4,IF(SUMIF(Table131518710[Type of Care], \"QI\", Table131518710[Duration])<= 3, SUMIF(Table131518710[Type of Care], \"QI\", Table131518710[Duration]), 0))))  > 90, SUMIFS($G$13:G31, $D$13:D31,\"Direct/Indirect/Clinical Administration\",  $B$13:B31,\"<=\"&$D$10 + 14)+ ((IF(SUMIF(Table131518710[Type of Care], \"QI\", Table131518710[Duration])>= 4, 4,IF(SUMIF(Table131518710[Type of Care], \"QI\", Table131518710[Duration])<= 3, SUMIF(Table131518710[Type of Care], \"QI\", Table131518710[Duration]), 0))))> 90)","v":false}]
[null,null,"",null,null,null,null,{"$f":"IF( B32 > $D$10+14, SUMIFS($G$13:G32, $D$13:D32,\"Direct/Indirect/Clinical Administration\", $B$13:B32,\">\"&$D$10 + 14) + ((IF(SUMIF(Table131518710[Type of Care], \"QI\", Table131518710[Duration])>= 4, 4,IF(SUMIF(Table131518710[Type of Care], \"QI\", Table131518710[Duration])<= 3, SUMIF(Table131518710[Type of Care], \"QI\", Table131518710[Duration]), 0))))  > 90, SUMIFS($G$13:G32, $D$13:D32,\"Direct/Indirect/Clinical Administration\",  $B$13:B32,\"<=\"&$D$10 + 14)+ ((IF(SUMIF(Table131518710[Type of Care], \"QI\", Table131518710[Duration])>= 4, 4,IF(SUMIF(Table131518710[Type of Care], \"QI\", Table131518710[Duration])<= 3, SUMIF(Table131518710[Type of Care], \"QI\", Table131518710[Duration]), 0))))> 90)","v":false}]
[null,null,"",null,null,null,null,{"$f":"IF( B33 > $D$10+14, SUMIFS($G$13:G33, $D$13:D33,\"Direct/Indirect/Clinical Administration\", $B$13:B33,\">\"&$D$10 + 14) + ((IF(SUMIF(Table131518710[Type of Care], \"QI\", Table131518710[Duration])>= 4, 4,IF(SUMIF(Table131518710[Type of Care], \"QI\", Table131518710[Duration])<= 3, SUMIF(Table131518710[Type of Care], \"QI\", Table131518710[Duration]), 0))))  > 90, SUMIFS($G$13:G33, $D$13:D33,\"Direct/Indirect/Clinical Administration\",  $B$13:B33,\"<=\"&$D$10 + 14)+ ((IF(SUMIF(Table131518710[Type of Care], \"QI\", Table131518710[Duration])>= 4, 4,IF(SUMIF(Table131518710[Type of Care], \"QI\", Table131518710[Duration])<= 3, SUMIF(Table131518710[Type of Care], \"QI\", Table131518710[Duration]), 0))))> 90)","v":false}]
[null,null,"",null,null,null,null,{"$f":"IF( B34 > $D$10+14, SUMIFS($G$13:G34, $D$13:D34,\"Direct/Indirect/Clinical Administration\", $B$13:B34,\">\"&$D$10 + 14) + ((IF(SUMIF(Table131518710[Type of Care], \"QI\", Table131518710[Duration])>= 4, 4,IF(SUMIF(Table131518710[Type of Care], \"QI\", Table131518710[Duration])<= 3, SUMIF(Table131518710[Type of Care], \"QI\", Table131518710[Duration]), 0))))  > 90, SUMIFS($G$13:G34, $D$13:D34,\"Direct/Indirect/Clinical Administration\",  $B$13:B34,\"<=\"&$D$10 + 14)+ ((IF(SUMIF(Table131518710[Type of Care], \"QI\", Table131518710[Duration])>= 4, 4,IF(SUMIF(Table131518710[Type of Care], \"QI\", Table131518710[Duration])<= 3, SUMIF(Table131518710[Type of Care], \"QI\", Table131518710[Duration]), 0))))> 90)","v":false}]
[null,null,{"$f":"IF(B35=\"\", \"\", B35)","v":""},null,null,"Total Contract Hours",{"$f":"(SUMIF(Table131518710[Type of Care], \"Direct/Indirect/Clinical Administration\",Table131518710[Duration]))","v":0},"CT1"]
[null,null,null,null,null,"Total Included QI Hours",{"$f":"(IF(SUMIF(Table131518710[Type of Care], \"QI\", Table131518710[Duration])>= 4, 4,IF(SUMIF(Table131518710[Type of Care], \"QI\", Table131518710[Duration])<= 3, SUMIF(Table131518710[Type of Care], \"QI\", Table131518710[Duration]), 0)))","v":0},"QI1"]
[null,null,null,null,null,"Total Excluded Hours",{"$f":"G38+G39","v":0},"EX1"]
[null,null,null,null,null,"         Excluded Contract Hours",{"$f":"(SUMIF(Table131518710[Type of Care], \"Third Party/Specialist FFS\",Table131518710[Duration])) + (SUMIF(Table131518710[Type of Care], \"Break (>15 Minutes)\", Table131518710[Duration]))","v":0},"EXC1"]
[null,null,null,null,null,"      Excluded QI Hours",{"$f":"(SUMIF(Table131518710[Type of Care], \"QI\", Table131518710[Duration]) - (IF(SUMIF(Table131518710[Type of Care], \"QI\", Table131518710[Duration])>= 4, 4,IF(SUMIF(Table131518710[Type of Care], \"QI\", Table131518710[Duration])<= 3, SUMIF(Table131518710[Type of Care], \"QI\", Table131518710[Duration]), 0))))","v":0},"EXQI1"]
[null,null,{"$f":"IF(B40=\"\", \"\", B40)","v":""},null,null,"Hours Above 90hr/semi-monthly",{"$f":"  (IF(SUMIFS(Table131518710[Duration],Table131518710[Date (YYYY-MM-DD)], \">\"&$D$10+14, Table131518710[Type of Care], \"Direct/Indirect/Clinical Administration\")>= 90, (SUMIFS(Table131518710[Duration],Table131518710[Date (YYYY-MM-DD)], \">\"&$D$10+14, Table131518710[Type of Care], \"Direct/Indirect/Clinical Administration\")+ (IF(SUMIF(Table131518710[Type of Care], \"QI\", Table131518710[Duration])>= 4, 4,IF(SUMIF(Table131518710[Type of Care], \"QI\", Table131518710[Duration])<= 3, SUMIF(Table131518710[Type of Care], \"QI\", Table131518710[Duration]), 0))) -90))) + (IF(SUMIFS(Table131518710[Duration],Table131518710[Date (YYYY-MM-DD)], \"<=\"&$D$10+14, Table131518710[Type of Care], \"Direct/Indirect/Clinical Administration\")>= 90, (SUMIFS(Table131518710[Duration],Table131518710[Date (YYYY-MM-DD)], \"<=\"&$D$10+14, Table131518710[Type of Care], \"Direct/Indirect/Clinical Administration\")+ (IF(SUMIF(Table131518710[Type of Care], \"QI\", Table131518710[Duration])>= 4, 4,IF(SUMIF(Table131518710[Type of Care], \"QI\", Table131518710[Duration])<= 3, SUMIF(Table131518710[Type of Care], \"QI\", Table131518710[Duration]), 0))) -90)))","v":0},"A901"]
[]
[]
[null,{"$f":"IF(Clinic!C5=\"Jan - Mar\", \"February\", IF(Clinic!C5= \"Apr - June\", \"May\", IF(Clinic!C5=\"July - Sept\", \"August\", IF(Clinic!C5=\" Oct - Dec\", \"November\"))))","v":"February"},{"$f":"Clinic!C6","v":2021},{"$f":"DATE(YEAR(B46),MONTH(DATEVALUE(B43&\"1\")),1)","v":"1900-02-01"},null,null,null,"Month2"]
[]
[null,"Date (YYYY-MM-DD)","Day ","Type of Care","Start Time AM/PM","End Time AM/PM","Duration","FALSE/TRUE"]
[null,null,{"$f":"IF(B46=\"\", \"\", B46)","v":""},null,null,null,null,{"$f":"IF( B46 > $D$43+14, SUMIFS($G$46:G46, $D$46:D46,\"Direct/Indirect/Clinical Administration\", $B$46:B46,\">\"&$D$43 + 14) + ((IF(SUMIF(Table1321619811[Type of Care], \"QI\", Table1321619811[Duration])>= 4, 4,IF(SUMIF(Table1321619811[Type of Care], \"QI\", Table1321619811[Duration])<= 3, SUMIF(Table1321619811[Type of Care], \"QI\", Table1321619811[Duration]), 0))))  > 90, SUMIFS($G$46:G46, $D$46:D46,\"Direct/Indirect/Clinical Administration\",  $B$46:B46,\"<=\"&$D$43 + 14)+ ((IF(SUMIF(Table1321619811[Type of Care], \"QI\", Table1321619811[Duration])>= 4, 4,IF(SUMIF(Table1321619811[Type of Care], \"QI\", Table1321619811[Duration])<= 3, SUMIF(Table1321619811[Type of Care], \"QI\", Table1321619811[Duration]), 0))))> 90)","v":false}]
[null,null,{"$f":"IF(B47=\"\", \"\", B47)","v":""},null,null,null,null,{"$f":"IF( B47 > $D$43+14, SUMIFS($G$46:G47, $D$46:D47,\"Direct/Indirect/Clinical Administration\", $B$46:B47,\">\"&$D$43 + 14) + ((IF(SUMIF(Table1321619811[Type of Care], \"QI\", Table1321619811[Duration])>= 4, 4,IF(SUMIF(Table1321619811[Type of Care], \"QI\", Table1321619811[Duration])<= 3, SUMIF(Table1321619811[Type of Care], \"QI\", Table1321619811[Duration]), 0))))  > 90, SUMIFS($G$46:G47, $D$46:D47,\"Direct/Indirect/Clinical Administration\",  $B$46:B47,\"<=\"&$D$43 + 14)+ ((IF(SUMIF(Table1321619811[Type of Care], \"QI\", Table1321619811[Duration])>= 4, 4,IF(SUMIF(Table1321619811[Type of Care], \"QI\", Table1321619811[Duration])<= 3, SUMIF(Table1321619811[Type of Care], \"QI\", Table1321619811[Duration]), 0))))> 90)","v":false}]
[null,null,"",null,null,null,null,{"$f":"IF( B48 > $D$43+14, SUMIFS($G$46:G48, $D$46:D48,\"Direct/Indirect/Clinical Administration\", $B$46:B48,\">\"&$D$43 + 14) + ((IF(SUMIF(Table1321619811[Type of Care], \"QI\", Table1321619811[Duration])>= 4, 4,IF(SUMIF(Table1321619811[Type of Care], \"QI\", Table1321619811[Duration])<= 3, SUMIF(Table1321619811[Type of Care], \"QI\", Table1321619811[Duration]), 0))))  > 90, SUMIFS($G$46:G48, $D$46:D48,\"Direct/Indirect/Clinical Administration\",  $B$46:B48,\"<=\"&$D$43 + 14)+ ((IF(SUMIF(Table1321619811[Type of Care], \"QI\", Table1321619811[Duration])>= 4, 4,IF(SUMIF(Table1321619811[Type of Care], \"QI\", Table1321619811[Duration])<= 3, SUMIF(Table1321619811[Type of Care], \"QI\", Table1321619811[Duration]), 0))))> 90)","v":false}]
[null,null,"",null,null,null,null,{"$f":"IF( B49 > $D$43+14, SUMIFS($G$46:G49, $D$46:D49,\"Direct/Indirect/Clinical Administration\", $B$46:B49,\">\"&$D$43 + 14) + ((IF(SUMIF(Table1321619811[Type of Care], \"QI\", Table1321619811[Duration])>= 4, 4,IF(SUMIF(Table1321619811[Type of Care], \"QI\", Table1321619811[Duration])<= 3, SUMIF(Table1321619811[Type of Care], \"QI\", Table1321619811[Duration]), 0))))  > 90, SUMIFS($G$46:G49, $D$46:D49,\"Direct/Indirect/Clinical Administration\",  $B$46:B49,\"<=\"&$D$43 + 14)+ ((IF(SUMIF(Table1321619811[Type of Care], \"QI\", Table1321619811[Duration])>= 4, 4,IF(SUMIF(Table1321619811[Type of Care], \"QI\", Table1321619811[Duration])<= 3, SUMIF(Table1321619811[Type of Care], \"QI\", Table1321619811[Duration]), 0))))> 90)","v":false}]
[null,null,"",null,null,null,null,{"$f":"IF( B50 > $D$43+14, SUMIFS($G$46:G50, $D$46:D50,\"Direct/Indirect/Clinical Administration\", $B$46:B50,\">\"&$D$43 + 14) + ((IF(SUMIF(Table1321619811[Type of Care], \"QI\", Table1321619811[Duration])>= 4, 4,IF(SUMIF(Table1321619811[Type of Care], \"QI\", Table1321619811[Duration])<= 3, SUMIF(Table1321619811[Type of Care], \"QI\", Table1321619811[Duration]), 0))))  > 90, SUMIFS($G$46:G50, $D$46:D50,\"Direct/Indirect/Clinical Administration\",  $B$46:B50,\"<=\"&$D$43 + 14)+ ((IF(SUMIF(Table1321619811[Type of Care], \"QI\", Table1321619811[Duration])>= 4, 4,IF(SUMIF(Table1321619811[Type of Care], \"QI\", Table1321619811[Duration])<= 3, SUMIF(Table1321619811[Type of Care], \"QI\", Table1321619811[Duration]), 0))))> 90)","v":false}]
[null,null,"",null,null,null,null,{"$f":"IF( B51 > $D$43+14, SUMIFS($G$46:G51, $D$46:D51,\"Direct/Indirect/Clinical Administration\", $B$46:B51,\">\"&$D$43 + 14) + ((IF(SUMIF(Table1321619811[Type of Care], \"QI\", Table1321619811[Duration])>= 4, 4,IF(SUMIF(Table1321619811[Type of Care], \"QI\", Table1321619811[Duration])<= 3, SUMIF(Table1321619811[Type of Care], \"QI\", Table1321619811[Duration]), 0))))  > 90, SUMIFS($G$46:G51, $D$46:D51,\"Direct/Indirect/Clinical Administration\",  $B$46:B51,\"<=\"&$D$43 + 14)+ ((IF(SUMIF(Table1321619811[Type of Care], \"QI\", Table1321619811[Duration])>= 4, 4,IF(SUMIF(Table1321619811[Type of Care], \"QI\", Table1321619811[Duration])<= 3, SUMIF(Table1321619811[Type of Care], \"QI\", Table1321619811[Duration]), 0))))> 90)","v":false}]
[null,null,"",null,null,null,null,{"$f":"IF( B52 > $D$43+14, SUMIFS($G$46:G52, $D$46:D52,\"Direct/Indirect/Clinical Administration\", $B$46:B52,\">\"&$D$43 + 14) + ((IF(SUMIF(Table1321619811[Type of Care], \"QI\", Table1321619811[Duration])>= 4, 4,IF(SUMIF(Table1321619811[Type of Care], \"QI\", Table1321619811[Duration])<= 3, SUMIF(Table1321619811[Type of Care], \"QI\", Table1321619811[Duration]), 0))))  > 90, SUMIFS($G$46:G52, $D$46:D52,\"Direct/Indirect/Clinical Administration\",  $B$46:B52,\"<=\"&$D$43 + 14)+ ((IF(SUMIF(Table1321619811[Type of Care], \"QI\", Table1321619811[Duration])>= 4, 4,IF(SUMIF(Table1321619811[Type of Care], \"QI\", Table1321619811[Duration])<= 3, SUMIF(Table1321619811[Type of Care], \"QI\", Table1321619811[Duration]), 0))))> 90)","v":false}]
[null,null,"",null,null,null,null,{"$f":"IF( B53 > $D$43+14, SUMIFS($G$46:G53, $D$46:D53,\"Direct/Indirect/Clinical Administration\", $B$46:B53,\">\"&$D$43 + 14) + ((IF(SUMIF(Table1321619811[Type of Care], \"QI\", Table1321619811[Duration])>= 4, 4,IF(SUMIF(Table1321619811[Type of Care], \"QI\", Table1321619811[Duration])<= 3, SUMIF(Table1321619811[Type of Care], \"QI\", Table1321619811[Duration]), 0))))  > 90, SUMIFS($G$46:G53, $D$46:D53,\"Direct/Indirect/Clinical Administration\",  $B$46:B53,\"<=\"&$D$43 + 14)+ ((IF(SUMIF(Table1321619811[Type of Care], \"QI\", Table1321619811[Duration])>= 4, 4,IF(SUMIF(Table1321619811[Type of Care], \"QI\", Table1321619811[Duration])<= 3, SUMIF(Table1321619811[Type of Care], \"QI\", Table1321619811[Duration]), 0))))> 90)","v":false}]
[null,null,"",null,null,null,null,{"$f":"IF( B54 > $D$43+14, SUMIFS($G$46:G54, $D$46:D54,\"Direct/Indirect/Clinical Administration\", $B$46:B54,\">\"&$D$43 + 14) + ((IF(SUMIF(Table1321619811[Type of Care], \"QI\", Table1321619811[Duration])>= 4, 4,IF(SUMIF(Table1321619811[Type of Care], \"QI\", Table1321619811[Duration])<= 3, SUMIF(Table1321619811[Type of Care], \"QI\", Table1321619811[Duration]), 0))))  > 90, SUMIFS($G$46:G54, $D$46:D54,\"Direct/Indirect/Clinical Administration\",  $B$46:B54,\"<=\"&$D$43 + 14)+ ((IF(SUMIF(Table1321619811[Type of Care], \"QI\", Table1321619811[Duration])>= 4, 4,IF(SUMIF(Table1321619811[Type of Care], \"QI\", Table1321619811[Duration])<= 3, SUMIF(Table1321619811[Type of Care], \"QI\", Table1321619811[Duration]), 0))))> 90)","v":false}]
[null,null,"",null,null,null,null,{"$f":"IF( B55 > $D$43+14, SUMIFS($G$46:G55, $D$46:D55,\"Direct/Indirect/Clinical Administration\", $B$46:B55,\">\"&$D$43 + 14) + ((IF(SUMIF(Table1321619811[Type of Care], \"QI\", Table1321619811[Duration])>= 4, 4,IF(SUMIF(Table1321619811[Type of Care], \"QI\", Table1321619811[Duration])<= 3, SUMIF(Table1321619811[Type of Care], \"QI\", Table1321619811[Duration]), 0))))  > 90, SUMIFS($G$46:G55, $D$46:D55,\"Direct/Indirect/Clinical Administration\",  $B$46:B55,\"<=\"&$D$43 + 14)+ ((IF(SUMIF(Table1321619811[Type of Care], \"QI\", Table1321619811[Duration])>= 4, 4,IF(SUMIF(Table1321619811[Type of Care], \"QI\", Table1321619811[Duration])<= 3, SUMIF(Table1321619811[Type of Care], \"QI\", Table1321619811[Duration]), 0))))> 90)","v":false}]
[null,null,"",null,null,null,null,{"$f":"IF( B56 > $D$43+14, SUMIFS($G$46:G56, $D$46:D56,\"Direct/Indirect/Clinical Administration\", $B$46:B56,\">\"&$D$43 + 14) + ((IF(SUMIF(Table1321619811[Type of Care], \"QI\", Table1321619811[Duration])>= 4, 4,IF(SUMIF(Table1321619811[Type of Care], \"QI\", Table1321619811[Duration])<= 3, SUMIF(Table1321619811[Type of Care], \"QI\", Table1321619811[Duration]), 0))))  > 90, SUMIFS($G$46:G56, $D$46:D56,\"Direct/Indirect/Clinical Administration\",  $B$46:B56,\"<=\"&$D$43 + 14)+ ((IF(SUMIF(Table1321619811[Type of Care], \"QI\", Table1321619811[Duration])>= 4, 4,IF(SUMIF(Table1321619811[Type of Care], \"QI\", Table1321619811[Duration])<= 3, SUMIF(Table1321619811[Type of Care], \"QI\", Table1321619811[Duration]), 0))))> 90)","v":false}]
[null,null,"",null,null,null,null,{"$f":"IF( B57 > $D$43+14, SUMIFS($G$46:G57, $D$46:D57,\"Direct/Indirect/Clinical Administration\", $B$46:B57,\">\"&$D$43 + 14) + ((IF(SUMIF(Table1321619811[Type of Care], \"QI\", Table1321619811[Duration])>= 4, 4,IF(SUMIF(Table1321619811[Type of Care], \"QI\", Table1321619811[Duration])<= 3, SUMIF(Table1321619811[Type of Care], \"QI\", Table1321619811[Duration]), 0))))  > 90, SUMIFS($G$46:G57, $D$46:D57,\"Direct/Indirect/Clinical Administration\",  $B$46:B57,\"<=\"&$D$43 + 14)+ ((IF(SUMIF(Table1321619811[Type of Care], \"QI\", Table1321619811[Duration])>= 4, 4,IF(SUMIF(Table1321619811[Type of Care], \"QI\", Table1321619811[Duration])<= 3, SUMIF(Table1321619811[Type of Care], \"QI\", Table1321619811[Duration]), 0))))> 90)","v":false}]
[null,null,"",null,null,null,null,{"$f":"IF( B58 > $D$43+14, SUMIFS($G$46:G58, $D$46:D58,\"Direct/Indirect/Clinical Administration\", $B$46:B58,\">\"&$D$43 + 14) + ((IF(SUMIF(Table1321619811[Type of Care], \"QI\", Table1321619811[Duration])>= 4, 4,IF(SUMIF(Table1321619811[Type of Care], \"QI\", Table1321619811[Duration])<= 3, SUMIF(Table1321619811[Type of Care], \"QI\", Table1321619811[Duration]), 0))))  > 90, SUMIFS($G$46:G58, $D$46:D58,\"Direct/Indirect/Clinical Administration\",  $B$46:B58,\"<=\"&$D$43 + 14)+ ((IF(SUMIF(Table1321619811[Type of Care], \"QI\", Table1321619811[Duration])>= 4, 4,IF(SUMIF(Table1321619811[Type of Care], \"QI\", Table1321619811[Duration])<= 3, SUMIF(Table1321619811[Type of Care], \"QI\", Table1321619811[Duration]), 0))))> 90)","v":false}]
[null,null,"",null,null,null,null,{"$f":"IF( B59 > $D$43+14, SUMIFS($G$46:G59, $D$46:D59,\"Direct/Indirect/Clinical Administration\", $B$46:B59,\">\"&$D$43 + 14) + ((IF(SUMIF(Table1321619811[Type of Care], \"QI\", Table1321619811[Duration])>= 4, 4,IF(SUMIF(Table1321619811[Type of Care], \"QI\", Table1321619811[Duration])<= 3, SUMIF(Table1321619811[Type of Care], \"QI\", Table1321619811[Duration]), 0))))  > 90, SUMIFS($G$46:G59, $D$46:D59,\"Direct/Indirect/Clinical Administration\",  $B$46:B59,\"<=\"&$D$43 + 14)+ ((IF(SUMIF(Table1321619811[Type of Care], \"QI\", Table1321619811[Duration])>= 4, 4,IF(SUMIF(Table1321619811[Type of Care], \"QI\", Table1321619811[Duration])<= 3, SUMIF(Table1321619811[Type of Care], \"QI\", Table1321619811[Duration]), 0))))> 90)","v":false}]
[null,null,"",null,null,null,null,{"$f":"IF( B60 > $D$43+14, SUMIFS($G$46:G60, $D$46:D60,\"Direct/Indirect/Clinical Administration\", $B$46:B60,\">\"&$D$43 + 14) + ((IF(SUMIF(Table1321619811[Type of Care], \"QI\", Table1321619811[Duration])>= 4, 4,IF(SUMIF(Table1321619811[Type of Care], \"QI\", Table1321619811[Duration])<= 3, SUMIF(Table1321619811[Type of Care], \"QI\", Table1321619811[Duration]), 0))))  > 90, SUMIFS($G$46:G60, $D$46:D60,\"Direct/Indirect/Clinical Administration\",  $B$46:B60,\"<=\"&$D$43 + 14)+ ((IF(SUMIF(Table1321619811[Type of Care], \"QI\", Table1321619811[Duration])>= 4, 4,IF(SUMIF(Table1321619811[Type of Care], \"QI\", Table1321619811[Duration])<= 3, SUMIF(Table1321619811[Type of Care], \"QI\", Table1321619811[Duration]), 0))))> 90)","v":false}]
[null,null,"",null,null,null,null,{"$f":"IF( B61 > $D$43+14, SUMIFS($G$46:G61, $D$46:D61,\"Direct/Indirect/Clinical Administration\", $B$46:B61,\">\"&$D$43 + 14) + ((IF(SUMIF(Table1321619811[Type of Care], \"QI\", Table1321619811[Duration])>= 4, 4,IF(SUMIF(Table1321619811[Type of Care], \"QI\", Table1321619811[Duration])<= 3, SUMIF(Table1321619811[Type of Care], \"QI\", Table1321619811[Duration]), 0))))  > 90, SUMIFS($G$46:G61, $D$46:D61,\"Direct/Indirect/Clinical Administration\",  $B$46:B61,\"<=\"&$D$43 + 14)+ ((IF(SUMIF(Table1321619811[Type of Care], \"QI\", Table1321619811[Duration])>= 4, 4,IF(SUMIF(Table1321619811[Type of Care], \"QI\", Table1321619811[Duration])<= 3, SUMIF(Table1321619811[Type of Care], \"QI\", Table1321619811[Duration]), 0))))> 90)","v":false}]
[null,null,"",null,null,null,null,{"$f":"IF( B62 > $D$43+14, SUMIFS($G$46:G62, $D$46:D62,\"Direct/Indirect/Clinical Administration\", $B$46:B62,\">\"&$D$43 + 14) + ((IF(SUMIF(Table1321619811[Type of Care], \"QI\", Table1321619811[Duration])>= 4, 4,IF(SUMIF(Table1321619811[Type of Care], \"QI\", Table1321619811[Duration])<= 3, SUMIF(Table1321619811[Type of Care], \"QI\", Table1321619811[Duration]), 0))))  > 90, SUMIFS($G$46:G62, $D$46:D62,\"Direct/Indirect/Clinical Administration\",  $B$46:B62,\"<=\"&$D$43 + 14)+ ((IF(SUMIF(Table1321619811[Type of Care], \"QI\", Table1321619811[Duration])>= 4, 4,IF(SUMIF(Table1321619811[Type of Care], \"QI\", Table1321619811[Duration])<= 3, SUMIF(Table1321619811[Type of Care], \"QI\", Table1321619811[Duration]), 0))))> 90)","v":false}]
[null,null,"",null,null,null,null,{"$f":"IF( B63 > $D$43+14, SUMIFS($G$46:G63, $D$46:D63,\"Direct/Indirect/Clinical Administration\", $B$46:B63,\">\"&$D$43 + 14) + ((IF(SUMIF(Table1321619811[Type of Care], \"QI\", Table1321619811[Duration])>= 4, 4,IF(SUMIF(Table1321619811[Type of Care], \"QI\", Table1321619811[Duration])<= 3, SUMIF(Table1321619811[Type of Care], \"QI\", Table1321619811[Duration]), 0))))  > 90, SUMIFS($G$46:G63, $D$46:D63,\"Direct/Indirect/Clinical Administration\",  $B$46:B63,\"<=\"&$D$43 + 14)+ ((IF(SUMIF(Table1321619811[Type of Care], \"QI\", Table1321619811[Duration])>= 4, 4,IF(SUMIF(Table1321619811[Type of Care], \"QI\", Table1321619811[Duration])<= 3, SUMIF(Table1321619811[Type of Care], \"QI\", Table1321619811[Duration]), 0))))> 90)","v":false}]
[null,null,"",null,null,null,null,{"$f":"IF( B64 > $D$43+14, SUMIFS($G$46:G64, $D$46:D64,\"Direct/Indirect/Clinical Administration\", $B$46:B64,\">\"&$D$43 + 14) + ((IF(SUMIF(Table1321619811[Type of Care], \"QI\", Table1321619811[Duration])>= 4, 4,IF(SUMIF(Table1321619811[Type of Care], \"QI\", Table1321619811[Duration])<= 3, SUMIF(Table1321619811[Type of Care], \"QI\", Table1321619811[Duration]), 0))))  > 90, SUMIFS($G$46:G64, $D$46:D64,\"Direct/Indirect/Clinical Administration\",  $B$46:B64,\"<=\"&$D$43 + 14)+ ((IF(SUMIF(Table1321619811[Type of Care], \"QI\", Table1321619811[Duration])>= 4, 4,IF(SUMIF(Table1321619811[Type of Care], \"QI\", Table1321619811[Duration])<= 3, SUMIF(Table1321619811[Type of Care], \"QI\", Table1321619811[Duration]), 0))))> 90)","v":false}]
[null,null,"",null,null,null,null,{"$f":"IF( B65 > $D$43+14, SUMIFS($G$46:G65, $D$46:D65,\"Direct/Indirect/Clinical Administration\", $B$46:B65,\">\"&$D$43 + 14) + ((IF(SUMIF(Table1321619811[Type of Care], \"QI\", Table1321619811[Duration])>= 4, 4,IF(SUMIF(Table1321619811[Type of Care], \"QI\", Table1321619811[Duration])<= 3, SUMIF(Table1321619811[Type of Care], \"QI\", Table1321619811[Duration]), 0))))  > 90, SUMIFS($G$46:G65, $D$46:D65,\"Direct/Indirect/Clinical Administration\",  $B$46:B65,\"<=\"&$D$43 + 14)+ ((IF(SUMIF(Table1321619811[Type of Care], \"QI\", Table1321619811[Duration])>= 4, 4,IF(SUMIF(Table1321619811[Type of Care], \"QI\", Table1321619811[Duration])<= 3, SUMIF(Table1321619811[Type of Care], \"QI\", Table1321619811[Duration]), 0))))> 90)","v":false}]
[null,null,"",null,null,null,null,{"$f":"IF( B66 > $D$43+14, SUMIFS($G$46:G66, $D$46:D66,\"Direct/Indirect/Clinical Administration\", $B$46:B66,\">\"&$D$43 + 14) + ((IF(SUMIF(Table1321619811[Type of Care], \"QI\", Table1321619811[Duration])>= 4, 4,IF(SUMIF(Table1321619811[Type of Care], \"QI\", Table1321619811[Duration])<= 3, SUMIF(Table1321619811[Type of Care], \"QI\", Table1321619811[Duration]), 0))))  > 90, SUMIFS($G$46:G66, $D$46:D66,\"Direct/Indirect/Clinical Administration\",  $B$46:B66,\"<=\"&$D$43 + 14)+ ((IF(SUMIF(Table1321619811[Type of Care], \"QI\", Table1321619811[Duration])>= 4, 4,IF(SUMIF(Table1321619811[Type of Care], \"QI\", Table1321619811[Duration])<= 3, SUMIF(Table1321619811[Type of Care], \"QI\", Table1321619811[Duration]), 0))))> 90)","v":false}]
[null,null,"",null,null,null,null,{"$f":"IF( B67 > $D$43+14, SUMIFS($G$46:G67, $D$46:D67,\"Direct/Indirect/Clinical Administration\", $B$46:B67,\">\"&$D$43 + 14) + ((IF(SUMIF(Table1321619811[Type of Care], \"QI\", Table1321619811[Duration])>= 4, 4,IF(SUMIF(Table1321619811[Type of Care], \"QI\", Table1321619811[Duration])<= 3, SUMIF(Table1321619811[Type of Care], \"QI\", Table1321619811[Duration]), 0))))  > 90, SUMIFS($G$46:G67, $D$46:D67,\"Direct/Indirect/Clinical Administration\",  $B$46:B67,\"<=\"&$D$43 + 14)+ ((IF(SUMIF(Table1321619811[Type of Care], \"QI\", Table1321619811[Duration])>= 4, 4,IF(SUMIF(Table1321619811[Type of Care], \"QI\", Table1321619811[Duration])<= 3, SUMIF(Table1321619811[Type of Care], \"QI\", Table1321619811[Duration]), 0))))> 90)","v":false}]
[null,null,"",null,null,null,null,{"$f":"IF( B68 > $D$43+14, SUMIFS($G$46:G68, $D$46:D68,\"Direct/Indirect/Clinical Administration\", $B$46:B68,\">\"&$D$43 + 14) + ((IF(SUMIF(Table1321619811[Type of Care], \"QI\", Table1321619811[Duration])>= 4, 4,IF(SUMIF(Table1321619811[Type of Care], \"QI\", Table1321619811[Duration])<= 3, SUMIF(Table1321619811[Type of Care], \"QI\", Table1321619811[Duration]), 0))))  > 90, SUMIFS($G$46:G68, $D$46:D68,\"Direct/Indirect/Clinical Administration\",  $B$46:B68,\"<=\"&$D$43 + 14)+ ((IF(SUMIF(Table1321619811[Type of Care], \"QI\", Table1321619811[Duration])>= 4, 4,IF(SUMIF(Table1321619811[Type of Care], \"QI\", Table1321619811[Duration])<= 3, SUMIF(Table1321619811[Type of Care], \"QI\", Table1321619811[Duration]), 0))))> 90)","v":false}]
[null,null,"",null,null,null,null,{"$f":"IF( B69 > $D$43+14, SUMIFS($G$46:G69, $D$46:D69,\"Direct/Indirect/Clinical Administration\", $B$46:B69,\">\"&$D$43 + 14) + ((IF(SUMIF(Table1321619811[Type of Care], \"QI\", Table1321619811[Duration])>= 4, 4,IF(SUMIF(Table1321619811[Type of Care], \"QI\", Table1321619811[Duration])<= 3, SUMIF(Table1321619811[Type of Care], \"QI\", Table1321619811[Duration]), 0))))  > 90, SUMIFS($G$46:G69, $D$46:D69,\"Direct/Indirect/Clinical Administration\",  $B$46:B69,\"<=\"&$D$43 + 14)+ ((IF(SUMIF(Table1321619811[Type of Care], \"QI\", Table1321619811[Duration])>= 4, 4,IF(SUMIF(Table1321619811[Type of Care], \"QI\", Table1321619811[Duration])<= 3, SUMIF(Table1321619811[Type of Care], \"QI\", Table1321619811[Duration]), 0))))> 90)","v":false}]
[null,null,"",null,null,null,null,{"$f":"IF( B70 > $D$43+14, SUMIFS($G$46:G70, $D$46:D70,\"Direct/Indirect/Clinical Administration\", $B$46:B70,\">\"&$D$43 + 14) + ((IF(SUMIF(Table1321619811[Type of Care], \"QI\", Table1321619811[Duration])>= 4, 4,IF(SUMIF(Table1321619811[Type of Care], \"QI\", Table1321619811[Duration])<= 3, SUMIF(Table1321619811[Type of Care], \"QI\", Table1321619811[Duration]), 0))))  > 90, SUMIFS($G$46:G70, $D$46:D70,\"Direct/Indirect/Clinical Administration\",  $B$46:B70,\"<=\"&$D$43 + 14)+ ((IF(SUMIF(Table1321619811[Type of Care], \"QI\", Table1321619811[Duration])>= 4, 4,IF(SUMIF(Table1321619811[Type of Care], \"QI\", Table1321619811[Duration])<= 3, SUMIF(Table1321619811[Type of Care], \"QI\", Table1321619811[Duration]), 0))))> 90)","v":false}]
[null,null,"",null,null,null,null,{"$f":"IF( B71 > $D$43+14, SUMIFS($G$46:G71, $D$46:D71,\"Direct/Indirect/Clinical Administration\", $B$46:B71,\">\"&$D$43 + 14) + ((IF(SUMIF(Table1321619811[Type of Care], \"QI\", Table1321619811[Duration])>= 4, 4,IF(SUMIF(Table1321619811[Type of Care], \"QI\", Table1321619811[Duration])<= 3, SUMIF(Table1321619811[Type of Care], \"QI\", Table1321619811[Duration]), 0))))  > 90, SUMIFS($G$46:G71, $D$46:D71,\"Direct/Indirect/Clinical Administration\",  $B$46:B71,\"<=\"&$D$43 + 14)+ ((IF(SUMIF(Table1321619811[Type of Care], \"QI\", Table1321619811[Duration])>= 4, 4,IF(SUMIF(Table1321619811[Type of Care], \"QI\", Table1321619811[Duration])<= 3, SUMIF(Table1321619811[Type of Care], \"QI\", Table1321619811[Duration]), 0))))> 90)","v":false}]
[null,null,"",null,null,null,null,{"$f":"IF( B72 > $D$43+14, SUMIFS($G$46:G72, $D$46:D72,\"Direct/Indirect/Clinical Administration\", $B$46:B72,\">\"&$D$43 + 14) + ((IF(SUMIF(Table1321619811[Type of Care], \"QI\", Table1321619811[Duration])>= 4, 4,IF(SUMIF(Table1321619811[Type of Care], \"QI\", Table1321619811[Duration])<= 3, SUMIF(Table1321619811[Type of Care], \"QI\", Table1321619811[Duration]), 0))))  > 90, SUMIFS($G$46:G72, $D$46:D72,\"Direct/Indirect/Clinical Administration\",  $B$46:B72,\"<=\"&$D$43 + 14)+ ((IF(SUMIF(Table1321619811[Type of Care], \"QI\", Table1321619811[Duration])>= 4, 4,IF(SUMIF(Table1321619811[Type of Care], \"QI\", Table1321619811[Duration])<= 3, SUMIF(Table1321619811[Type of Care], \"QI\", Table1321619811[Duration]), 0))))> 90)","v":false}]
[null,null,"",null,null,null,null,{"$f":"IF( B73 > $D$43+14, SUMIFS($G$46:G73, $D$46:D73,\"Direct/Indirect/Clinical Administration\", $B$46:B73,\">\"&$D$43 + 14) + ((IF(SUMIF(Table1321619811[Type of Care], \"QI\", Table1321619811[Duration])>= 4, 4,IF(SUMIF(Table1321619811[Type of Care], \"QI\", Table1321619811[Duration])<= 3, SUMIF(Table1321619811[Type of Care], \"QI\", Table1321619811[Duration]), 0))))  > 90, SUMIFS($G$46:G73, $D$46:D73,\"Direct/Indirect/Clinical Administration\",  $B$46:B73,\"<=\"&$D$43 + 14)+ ((IF(SUMIF(Table1321619811[Type of Care], \"QI\", Table1321619811[Duration])>= 4, 4,IF(SUMIF(Table1321619811[Type of Care], \"QI\", Table1321619811[Duration])<= 3, SUMIF(Table1321619811[Type of Care], \"QI\", Table1321619811[Duration]), 0))))> 90)","v":false}]
[null,null,"",null,null,null,null,{"$f":"IF( B74 > $D$43+14, SUMIFS($G$46:G74, $D$46:D74,\"Direct/Indirect/Clinical Administration\", $B$46:B74,\">\"&$D$43 + 14) + ((IF(SUMIF(Table1321619811[Type of Care], \"QI\", Table1321619811[Duration])>= 4, 4,IF(SUMIF(Table1321619811[Type of Care], \"QI\", Table1321619811[Duration])<= 3, SUMIF(Table1321619811[Type of Care], \"QI\", Table1321619811[Duration]), 0))))  > 90, SUMIFS($G$46:G74, $D$46:D74,\"Direct/Indirect/Clinical Administration\",  $B$46:B74,\"<=\"&$D$43 + 14)+ ((IF(SUMIF(Table1321619811[Type of Care], \"QI\", Table1321619811[Duration])>= 4, 4,IF(SUMIF(Table1321619811[Type of Care], \"QI\", Table1321619811[Duration])<= 3, SUMIF(Table1321619811[Type of Care], \"QI\", Table1321619811[Duration]), 0))))> 90)","v":false}]
[null,null,{"$f":"IF(B75=\"\", \"\", B75)","v":""},null,null,"Total Contract Hours",{"$f":"(SUMIF(Table1321619811[Type of Care], \"Direct/Indirect/Clinical Administration\",Table1321619811[Duration])) + (SUMIF(Table1321619811[Type of Care], \"Correction Hours\",Table1321619811[Duration]))","v":0},"CT2"]
[null,null,null,null,null,"Total Included QI Hours",{"$f":"(IF(SUMIF(Table1321619811[Type of Care], \"QI\", Table1321619811[Duration])>= 4, 4,IF(SUMIF(Table1321619811[Type of Care], \"QI\", Table1321619811[Duration])<= 3, SUMIF(Table1321619811[Type of Care], \"QI\", Table1321619811[Duration]), 0)))","v":0},"QI2"]
[null,null,null,null,null,"Total Excluded Hours",{"$f":"G78+G79","v":0},"EX2"]
[null,null,null,null,null,"         Excluded Contract Hours",{"$f":"(SUMIF(Table1321619811[Type of Care], \"Third Party/Specialist FFS\",Table1321619811[Duration])) + (SUMIF(Table1321619811[Type of Care], \"Break (>15 Minutes)\", Table1321619811[Duration]))","v":0},"EXC2"]
[null,null,null,null,null,"      Excluded QI Hours",{"$f":"(SUMIF(Table1321619811[Type of Care], \"QI\", Table1321619811[Duration]) - (IF(SUMIF(Table1321619811[Type of Care], \"QI\", Table1321619811[Duration])>= 4, 4,IF(SUMIF(Table1321619811[Type of Care], \"QI\", Table1321619811[Duration])<= 3, SUMIF(Table1321619811[Type of Care], \"QI\", Table1321619811[Duration]), 0))))","v":0},"EXQI2"]
[null,null,{"$f":"IF(B80=\"\", \"\", B80)","v":""},null,null,"Hours Above 90hr/semi-monthly",{"$f":"  (IF(SUMIFS(Table1321619811[Duration],Table1321619811[Date (YYYY-MM-DD)], \">\"&$D$43+14, Table1321619811[Type of Care], \"Direct/Indirect/Clinical Administration\")>= 90, (SUMIFS(Table1321619811[Duration],Table1321619811[Date (YYYY-MM-DD)], \">\"&$D$43+14, Table1321619811[Type of Care], \"Direct/Indirect/Clinical Administration\")+ (IF(SUMIF(Table1321619811[Type of Care], \"QI\", Table1321619811[Duration])>= 4, 4,IF(SUMIF(Table1321619811[Type of Care], \"QI\", Table1321619811[Duration])<= 3, SUMIF(Table1321619811[Type of Care], \"QI\", Table1321619811[Duration]), 0))) -90))) + (IF(SUMIFS(Table1321619811[Duration],Table1321619811[Date (YYYY-MM-DD)], \"<=\"&$D$43+14, Table1321619811[Type of Care], \"Direct/Indirect/Clinical Administration\")>= 90, (SUMIFS(Table1321619811[Duration],Table1321619811[Date (YYYY-MM-DD)], \"<=\"&$D$43+14, Table1321619811[Type of Care], \"Direct/Indirect/Clinical Administration\")+ (IF(SUMIF(Table1321619811[Type of Care], \"QI\", Table1321619811[Duration])>= 4, 4,IF(SUMIF(Table1321619811[Type of Care], \"QI\", Table1321619811[Duration])<= 3, SUMIF(Table1321619811[Type of Care], \"QI\", Table1321619811[Duration]), 0))) -90)))","v":0},"A902"]
[]
[]
[null,{"$f":"IF(Clinic!C5=\"Jan - Mar\", \"March\", IF(Clinic!C5= \"Apr - June\", \"June\", IF(Clinic!C5=\"July - Sept\", \"September\", IF(Clinic!C5=\" Oct - Dec\", \"December\"))))","v":"March"},{"$f":"Clinic!C6","v":2021},{"$f":"DATE(YEAR(B86),MONTH(DATEVALUE(B83&\"1\")),1)","v":"1900-03-01"},null,null,null,"Month3"]
[]
[null,"Date (YYYY-MM-DD)","Day ","Type of Care","Start Time AM/PM","End Time AM/PM","Duration ","FALSE/TRUE"]
[null,null,{"$f":"IF(B86=\"\", \"\", B86)","v":""},null,null,null,null,{"$f":"IF( B86 > $D$83+14, SUMIFS($G$86:G86, $D$86:D86,\"Direct/Indirect/Clinical Administration\", $B$86:B86,\">\"&$D$83 + 14) + ((IF(SUMIF(Table13261720912[Type of Care], \"QI\", Table13261720912[[Duration ]])>= 4, 4,IF(SUMIF(Table13261720912[Type of Care], \"QI\", Table13261720912[[Duration ]])<= 3, SUMIF(Table13261720912[Type of Care], \"QI\", Table13261720912[[Duration ]]), 0))))  > 90, SUMIFS($G$86:G86, $D$86:D86,\"Direct/Indirect/Clinical Administration\",  $B$86:B86,\"<=\"&$D$83 + 14)+ ((IF(SUMIF(Table13261720912[Type of Care], \"QI\", Table13261720912[[Duration ]])>= 4, 4,IF(SUMIF(Table13261720912[Type of Care], \"QI\", Table13261720912[[Duration ]])<= 3, SUMIF(Table13261720912[Type of Care], \"QI\", Table13261720912[[Duration ]]), 0))))> 90)","v":false}]
[null,null,{"$f":"IF(B87=\"\", \"\", B87)","v":""},null,null,null,null,{"$f":"IF( B87 > $D$83+14, SUMIFS($G$86:G87, $D$86:D87,\"Direct/Indirect/Clinical Administration\", $B$86:B87,\">\"&$D$83 + 14) + ((IF(SUMIF(Table13261720912[Type of Care], \"QI\", Table13261720912[[Duration ]])>= 4, 4,IF(SUMIF(Table13261720912[Type of Care], \"QI\", Table13261720912[[Duration ]])<= 3, SUMIF(Table13261720912[Type of Care], \"QI\", Table13261720912[[Duration ]]), 0))))  > 90, SUMIFS($G$86:G87, $D$86:D87,\"Direct/Indirect/Clinical Administration\",  $B$86:B87,\"<=\"&$D$83 + 14)+ ((IF(SUMIF(Table13261720912[Type of Care], \"QI\", Table13261720912[[Duration ]])>= 4, 4,IF(SUMIF(Table13261720912[Type of Care], \"QI\", Table13261720912[[Duration ]])<= 3, SUMIF(Table13261720912[Type of Care], \"QI\", Table13261720912[[Duration ]]), 0))))> 90)","v":false}]
[null,null,"",null,null,null,null,{"$f":"IF( B88 > $D$83+14, SUMIFS($G$86:G88, $D$86:D88,\"Direct/Indirect/Clinical Administration\", $B$86:B88,\">\"&$D$83 + 14) + ((IF(SUMIF(Table13261720912[Type of Care], \"QI\", Table13261720912[[Duration ]])>= 4, 4,IF(SUMIF(Table13261720912[Type of Care], \"QI\", Table13261720912[[Duration ]])<= 3, SUMIF(Table13261720912[Type of Care], \"QI\", Table13261720912[[Duration ]]), 0))))  > 90, SUMIFS($G$86:G88, $D$86:D88,\"Direct/Indirect/Clinical Administration\",  $B$86:B88,\"<=\"&$D$83 + 14)+ ((IF(SUMIF(Table13261720912[Type of Care], \"QI\", Table13261720912[[Duration ]])>= 4, 4,IF(SUMIF(Table13261720912[Type of Care], \"QI\", Table13261720912[[Duration ]])<= 3, SUMIF(Table13261720912[Type of Care], \"QI\", Table13261720912[[Duration ]]), 0))))> 90)","v":false}]
[null,null,"",null,null,null,null,{"$f":"IF( B89 > $D$83+14, SUMIFS($G$86:G89, $D$86:D89,\"Direct/Indirect/Clinical Administration\", $B$86:B89,\">\"&$D$83 + 14) + ((IF(SUMIF(Table13261720912[Type of Care], \"QI\", Table13261720912[[Duration ]])>= 4, 4,IF(SUMIF(Table13261720912[Type of Care], \"QI\", Table13261720912[[Duration ]])<= 3, SUMIF(Table13261720912[Type of Care], \"QI\", Table13261720912[[Duration ]]), 0))))  > 90, SUMIFS($G$86:G89, $D$86:D89,\"Direct/Indirect/Clinical Administration\",  $B$86:B89,\"<=\"&$D$83 + 14)+ ((IF(SUMIF(Table13261720912[Type of Care], \"QI\", Table13261720912[[Duration ]])>= 4, 4,IF(SUMIF(Table13261720912[Type of Care], \"QI\", Table13261720912[[Duration ]])<= 3, SUMIF(Table13261720912[Type of Care], \"QI\", Table13261720912[[Duration ]]), 0))))> 90)","v":false}]
[null,null,"",null,null,null,null,{"$f":"IF( B90 > $D$83+14, SUMIFS($G$86:G90, $D$86:D90,\"Direct/Indirect/Clinical Administration\", $B$86:B90,\">\"&$D$83 + 14) + ((IF(SUMIF(Table13261720912[Type of Care], \"QI\", Table13261720912[[Duration ]])>= 4, 4,IF(SUMIF(Table13261720912[Type of Care], \"QI\", Table13261720912[[Duration ]])<= 3, SUMIF(Table13261720912[Type of Care], \"QI\", Table13261720912[[Duration ]]), 0))))  > 90, SUMIFS($G$86:G90, $D$86:D90,\"Direct/Indirect/Clinical Administration\",  $B$86:B90,\"<=\"&$D$83 + 14)+ ((IF(SUMIF(Table13261720912[Type of Care], \"QI\", Table13261720912[[Duration ]])>= 4, 4,IF(SUMIF(Table13261720912[Type of Care], \"QI\", Table13261720912[[Duration ]])<= 3, SUMIF(Table13261720912[Type of Care], \"QI\", Table13261720912[[Duration ]]), 0))))> 90)","v":false}]
[null,null,"",null,null,null,null,{"$f":"IF( B91 > $D$83+14, SUMIFS($G$86:G91, $D$86:D91,\"Direct/Indirect/Clinical Administration\", $B$86:B91,\">\"&$D$83 + 14) + ((IF(SUMIF(Table13261720912[Type of Care], \"QI\", Table13261720912[[Duration ]])>= 4, 4,IF(SUMIF(Table13261720912[Type of Care], \"QI\", Table13261720912[[Duration ]])<= 3, SUMIF(Table13261720912[Type of Care], \"QI\", Table13261720912[[Duration ]]), 0))))  > 90, SUMIFS($G$86:G91, $D$86:D91,\"Direct/Indirect/Clinical Administration\",  $B$86:B91,\"<=\"&$D$83 + 14)+ ((IF(SUMIF(Table13261720912[Type of Care], \"QI\", Table13261720912[[Duration ]])>= 4, 4,IF(SUMIF(Table13261720912[Type of Care], \"QI\", Table13261720912[[Duration ]])<= 3, SUMIF(Table13261720912[Type of Care], \"QI\", Table13261720912[[Duration ]]), 0))))> 90)","v":false}]
[null,null,"",null,null,null,null,{"$f":"IF( B92 > $D$83+14, SUMIFS($G$86:G92, $D$86:D92,\"Direct/Indirect/Clinical Administration\", $B$86:B92,\">\"&$D$83 + 14) + ((IF(SUMIF(Table13261720912[Type of Care], \"QI\", Table13261720912[[Duration ]])>= 4, 4,IF(SUMIF(Table13261720912[Type of Care], \"QI\", Table13261720912[[Duration ]])<= 3, SUMIF(Table13261720912[Type of Care], \"QI\", Table13261720912[[Duration ]]), 0))))  > 90, SUMIFS($G$86:G92, $D$86:D92,\"Direct/Indirect/Clinical Administration\",  $B$86:B92,\"<=\"&$D$83 + 14)+ ((IF(SUMIF(Table13261720912[Type of Care], \"QI\", Table13261720912[[Duration ]])>= 4, 4,IF(SUMIF(Table13261720912[Type of Care], \"QI\", Table13261720912[[Duration ]])<= 3, SUMIF(Table13261720912[Type of Care], \"QI\", Table13261720912[[Duration ]]), 0))))> 90)","v":false}]
[null,null,"",null,null,null,null,{"$f":"IF( B93 > $D$83+14, SUMIFS($G$86:G93, $D$86:D93,\"Direct/Indirect/Clinical Administration\", $B$86:B93,\">\"&$D$83 + 14) + ((IF(SUMIF(Table13261720912[Type of Care], \"QI\", Table13261720912[[Duration ]])>= 4, 4,IF(SUMIF(Table13261720912[Type of Care], \"QI\", Table13261720912[[Duration ]])<= 3, SUMIF(Table13261720912[Type of Care], \"QI\", Table13261720912[[Duration ]]), 0))))  > 90, SUMIFS($G$86:G93, $D$86:D93,\"Direct/Indirect/Clinical Administration\",  $B$86:B93,\"<=\"&$D$83 + 14)+ ((IF(SUMIF(Table13261720912[Type of Care], \"QI\", Table13261720912[[Duration ]])>= 4, 4,IF(SUMIF(Table13261720912[Type of Care], \"QI\", Table13261720912[[Duration ]])<= 3, SUMIF(Table13261720912[Type of Care], \"QI\", Table13261720912[[Duration ]]), 0))))> 90)","v":false}]
[null,null,"",null,null,null,null,{"$f":"IF( B94 > $D$83+14, SUMIFS($G$86:G94, $D$86:D94,\"Direct/Indirect/Clinical Administration\", $B$86:B94,\">\"&$D$83 + 14) + ((IF(SUMIF(Table13261720912[Type of Care], \"QI\", Table13261720912[[Duration ]])>= 4, 4,IF(SUMIF(Table13261720912[Type of Care], \"QI\", Table13261720912[[Duration ]])<= 3, SUMIF(Table13261720912[Type of Care], \"QI\", Table13261720912[[Duration ]]), 0))))  > 90, SUMIFS($G$86:G94, $D$86:D94,\"Direct/Indirect/Clinical Administration\",  $B$86:B94,\"<=\"&$D$83 + 14)+ ((IF(SUMIF(Table13261720912[Type of Care], \"QI\", Table13261720912[[Duration ]])>= 4, 4,IF(SUMIF(Table13261720912[Type of Care], \"QI\", Table13261720912[[Duration ]])<= 3, SUMIF(Table13261720912[Type of Care], \"QI\", Table13261720912[[Duration ]]), 0))))> 90)","v":false}]
[null,null,"",null,null,null,null,{"$f":"IF( B95 > $D$83+14, SUMIFS($G$86:G95, $D$86:D95,\"Direct/Indirect/Clinical Administration\", $B$86:B95,\">\"&$D$83 + 14) + ((IF(SUMIF(Table13261720912[Type of Care], \"QI\", Table13261720912[[Duration ]])>= 4, 4,IF(SUMIF(Table13261720912[Type of Care], \"QI\", Table13261720912[[Duration ]])<= 3, SUMIF(Table13261720912[Type of Care], \"QI\", Table13261720912[[Duration ]]), 0))))  > 90, SUMIFS($G$86:G95, $D$86:D95,\"Direct/Indirect/Clinical Administration\",  $B$86:B95,\"<=\"&$D$83 + 14)+ ((IF(SUMIF(Table13261720912[Type of Care], \"QI\", Table13261720912[[Duration ]])>= 4, 4,IF(SUMIF(Table13261720912[Type of Care], \"QI\", Table13261720912[[Duration ]])<= 3, SUMIF(Table13261720912[Type of Care], \"QI\", Table13261720912[[Duration ]]), 0))))> 90)","v":false}]
[null,null,"",null,null,null,null,{"$f":"IF( B96 > $D$83+14, SUMIFS($G$86:G96, $D$86:D96,\"Direct/Indirect/Clinical Administration\", $B$86:B96,\">\"&$D$83 + 14) + ((IF(SUMIF(Table13261720912[Type of Care], \"QI\", Table13261720912[[Duration ]])>= 4, 4,IF(SUMIF(Table13261720912[Type of Care], \"QI\", Table13261720912[[Duration ]])<= 3, SUMIF(Table13261720912[Type of Care], \"QI\", Table13261720912[[Duration ]]), 0))))  > 90, SUMIFS($G$86:G96, $D$86:D96,\"Direct/Indirect/Clinical Administration\",  $B$86:B96,\"<=\"&$D$83 + 14)+ ((IF(SUMIF(Table13261720912[Type of Care], \"QI\", Table13261720912[[Duration ]])>= 4, 4,IF(SUMIF(Table13261720912[Type of Care], \"QI\", Table13261720912[[Duration ]])<= 3, SUMIF(Table13261720912[Type of Care], \"QI\", Table13261720912[[Duration ]]), 0))))> 90)","v":false}]
[null,null,"",null,null,null,null,{"$f":"IF( B97 > $D$83+14, SUMIFS($G$86:G97, $D$86:D97,\"Direct/Indirect/Clinical Administration\", $B$86:B97,\">\"&$D$83 + 14) + ((IF(SUMIF(Table13261720912[Type of Care], \"QI\", Table13261720912[[Duration ]])>= 4, 4,IF(SUMIF(Table13261720912[Type of Care], \"QI\", Table13261720912[[Duration ]])<= 3, SUMIF(Table13261720912[Type of Care], \"QI\", Table13261720912[[Duration ]]), 0))))  > 90, SUMIFS($G$86:G97, $D$86:D97,\"Direct/Indirect/Clinical Administration\",  $B$86:B97,\"<=\"&$D$83 + 14)+ ((IF(SUMIF(Table13261720912[Type of Care], \"QI\", Table13261720912[[Duration ]])>= 4, 4,IF(SUMIF(Table13261720912[Type of Care], \"QI\", Table13261720912[[Duration ]])<= 3, SUMIF(Table13261720912[Type of Care], \"QI\", Table13261720912[[Duration ]]), 0))))> 90)","v":false}]
[null,null,"",null,null,null,null,{"$f":"IF( B98 > $D$83+14, SUMIFS($G$86:G98, $D$86:D98,\"Direct/Indirect/Clinical Administration\", $B$86:B98,\">\"&$D$83 + 14) + ((IF(SUMIF(Table13261720912[Type of Care], \"QI\", Table13261720912[[Duration ]])>= 4, 4,IF(SUMIF(Table13261720912[Type of Care], \"QI\", Table13261720912[[Duration ]])<= 3, SUMIF(Table13261720912[Type of Care], \"QI\", Table13261720912[[Duration ]]), 0))))  > 90, SUMIFS($G$86:G98, $D$86:D98,\"Direct/Indirect/Clinical Administration\",  $B$86:B98,\"<=\"&$D$83 + 14)+ ((IF(SUMIF(Table13261720912[Type of Care], \"QI\", Table13261720912[[Duration ]])>= 4, 4,IF(SUMIF(Table13261720912[Type of Care], \"QI\", Table13261720912[[Duration ]])<= 3, SUMIF(Table13261720912[Type of Care], \"QI\", Table13261720912[[Duration ]]), 0))))> 90)","v":false}]
[null,null,"",null,null,null,null,{"$f":"IF( B99 > $D$83+14, SUMIFS($G$86:G99, $D$86:D99,\"Direct/Indirect/Clinical Administration\", $B$86:B99,\">\"&$D$83 + 14) + ((IF(SUMIF(Table13261720912[Type of Care], \"QI\", Table13261720912[[Duration ]])>= 4, 4,IF(SUMIF(Table13261720912[Type of Care], \"QI\", Table13261720912[[Duration ]])<= 3, SUMIF(Table13261720912[Type of Care], \"QI\", Table13261720912[[Duration ]]), 0))))  > 90, SUMIFS($G$86:G99, $D$86:D99,\"Direct/Indirect/Clinical Administration\",  $B$86:B99,\"<=\"&$D$83 + 14)+ ((IF(SUMIF(Table13261720912[Type of Care], \"QI\", Table13261720912[[Duration ]])>= 4, 4,IF(SUMIF(Table13261720912[Type of Care], \"QI\", Table13261720912[[Duration ]])<= 3, SUMIF(Table13261720912[Type of Care], \"QI\", Table13261720912[[Duration ]]), 0))))> 90)","v":false}]
[null,null,"",null,null,null,null,{"$f":"IF( B100 > $D$83+14, SUMIFS($G$86:G100, $D$86:D100,\"Direct/Indirect/Clinical Administration\", $B$86:B100,\">\"&$D$83 + 14) + ((IF(SUMIF(Table13261720912[Type of Care], \"QI\", Table13261720912[[Duration ]])>= 4, 4,IF(SUMIF(Table13261720912[Type of Care], \"QI\", Table13261720912[[Duration ]])<= 3, SUMIF(Table13261720912[Type of Care], \"QI\", Table13261720912[[Duration ]]), 0))))  > 90, SUMIFS($G$86:G100, $D$86:D100,\"Direct/Indirect/Clinical Administration\",  $B$86:B100,\"<=\"&$D$83 + 14)+ ((IF(SUMIF(Table13261720912[Type of Care], \"QI\", Table13261720912[[Duration ]])>= 4, 4,IF(SUMIF(Table13261720912[Type of Care], \"QI\", Table13261720912[[Duration ]])<= 3, SUMIF(Table13261720912[Type of Care], \"QI\", Table13261720912[[Duration ]]), 0))))> 90)","v":false}]
[null,null,"",null,null,null,null,{"$f":"IF( B101 > $D$83+14, SUMIFS($G$86:G101, $D$86:D101,\"Direct/Indirect/Clinical Administration\", $B$86:B101,\">\"&$D$83 + 14) + ((IF(SUMIF(Table13261720912[Type of Care], \"QI\", Table13261720912[[Duration ]])>= 4, 4,IF(SUMIF(Table13261720912[Type of Care], \"QI\", Table13261720912[[Duration ]])<= 3, SUMIF(Table13261720912[Type of Care], \"QI\", Table13261720912[[Duration ]]), 0))))  > 90, SUMIFS($G$86:G101, $D$86:D101,\"Direct/Indirect/Clinical Administration\",  $B$86:B101,\"<=\"&$D$83 + 14)+ ((IF(SUMIF(Table13261720912[Type of Care], \"QI\", Table13261720912[[Duration ]])>= 4, 4,IF(SUMIF(Table13261720912[Type of Care], \"QI\", Table13261720912[[Duration ]])<= 3, SUMIF(Table13261720912[Type of Care], \"QI\", Table13261720912[[Duration ]]), 0))))> 90)","v":false}]
[null,null,"",null,null,null,null,{"$f":"IF( B102 > $D$83+14, SUMIFS($G$86:G102, $D$86:D102,\"Direct/Indirect/Clinical Administration\", $B$86:B102,\">\"&$D$83 + 14) + ((IF(SUMIF(Table13261720912[Type of Care], \"QI\", Table13261720912[[Duration ]])>= 4, 4,IF(SUMIF(Table13261720912[Type of Care], \"QI\", Table13261720912[[Duration ]])<= 3, SUMIF(Table13261720912[Type of Care], \"QI\", Table13261720912[[Duration ]]), 0))))  > 90, SUMIFS($G$86:G102, $D$86:D102,\"Direct/Indirect/Clinical Administration\",  $B$86:B102,\"<=\"&$D$83 + 14)+ ((IF(SUMIF(Table13261720912[Type of Care], \"QI\", Table13261720912[[Duration ]])>= 4, 4,IF(SUMIF(Table13261720912[Type of Care], \"QI\", Table13261720912[[Duration ]])<= 3, SUMIF(Table13261720912[Type of Care], \"QI\", Table13261720912[[Duration ]]), 0))))> 90)","v":false}]
[null,null,"",null,null,null,null,{"$f":"IF( B103 > $D$83+14, SUMIFS($G$86:G103, $D$86:D103,\"Direct/Indirect/Clinical Administration\", $B$86:B103,\">\"&$D$83 + 14) + ((IF(SUMIF(Table13261720912[Type of Care], \"QI\", Table13261720912[[Duration ]])>= 4, 4,IF(SUMIF(Table13261720912[Type of Care], \"QI\", Table13261720912[[Duration ]])<= 3, SUMIF(Table13261720912[Type of Care], \"QI\", Table13261720912[[Duration ]]), 0))))  > 90, SUMIFS($G$86:G103, $D$86:D103,\"Direct/Indirect/Clinical Administration\",  $B$86:B103,\"<=\"&$D$83 + 14)+ ((IF(SUMIF(Table13261720912[Type of Care], \"QI\", Table13261720912[[Duration ]])>= 4, 4,IF(SUMIF(Table13261720912[Type of Care], \"QI\", Table13261720912[[Duration ]])<= 3, SUMIF(Table13261720912[Type of Care], \"QI\", Table13261720912[[Duration ]]), 0))))> 90)","v":false}]
[null,null,"",null,null,null,null,{"$f":"IF( B104 > $D$83+14, SUMIFS($G$86:G104, $D$86:D104,\"Direct/Indirect/Clinical Administration\", $B$86:B104,\">\"&$D$83 + 14) + ((IF(SUMIF(Table13261720912[Type of Care], \"QI\", Table13261720912[[Duration ]])>= 4, 4,IF(SUMIF(Table13261720912[Type of Care], \"QI\", Table13261720912[[Duration ]])<= 3, SUMIF(Table13261720912[Type of Care], \"QI\", Table13261720912[[Duration ]]), 0))))  > 90, SUMIFS($G$86:G104, $D$86:D104,\"Direct/Indirect/Clinical Administration\",  $B$86:B104,\"<=\"&$D$83 + 14)+ ((IF(SUMIF(Table13261720912[Type of Care], \"QI\", Table13261720912[[Duration ]])>= 4, 4,IF(SUMIF(Table13261720912[Type of Care], \"QI\", Table13261720912[[Duration ]])<= 3, SUMIF(Table13261720912[Type of Care], \"QI\", Table13261720912[[Duration ]]), 0))))> 90)","v":false}]
[null,null,"",null,null,null,null,{"$f":"IF( B105 > $D$83+14, SUMIFS($G$86:G105, $D$86:D105,\"Direct/Indirect/Clinical Administration\", $B$86:B105,\">\"&$D$83 + 14) + ((IF(SUMIF(Table13261720912[Type of Care], \"QI\", Table13261720912[[Duration ]])>= 4, 4,IF(SUMIF(Table13261720912[Type of Care], \"QI\", Table13261720912[[Duration ]])<= 3, SUMIF(Table13261720912[Type of Care], \"QI\", Table13261720912[[Duration ]]), 0))))  > 90, SUMIFS($G$86:G105, $D$86:D105,\"Direct/Indirect/Clinical Administration\",  $B$86:B105,\"<=\"&$D$83 + 14)+ ((IF(SUMIF(Table13261720912[Type of Care], \"QI\", Table13261720912[[Duration ]])>= 4, 4,IF(SUMIF(Table13261720912[Type of Care], \"QI\", Table13261720912[[Duration ]])<= 3, SUMIF(Table13261720912[Type of Care], \"QI\", Table13261720912[[Duration ]]), 0))))> 90)","v":false}]
[null,null,"",null,null,null,null,{"$f":"IF( B106 > $D$83+14, SUMIFS($G$86:G106, $D$86:D106,\"Direct/Indirect/Clinical Administration\", $B$86:B106,\">\"&$D$83 + 14) + ((IF(SUMIF(Table13261720912[Type of Care], \"QI\", Table13261720912[[Duration ]])>= 4, 4,IF(SUMIF(Table13261720912[Type of Care], \"QI\", Table13261720912[[Duration ]])<= 3, SUMIF(Table13261720912[Type of Care], \"QI\", Table13261720912[[Duration ]]), 0))))  > 90, SUMIFS($G$86:G106, $D$86:D106,\"Direct/Indirect/Clinical Administration\",  $B$86:B106,\"<=\"&$D$83 + 14)+ ((IF(SUMIF(Table13261720912[Type of Care], \"QI\", Table13261720912[[Duration ]])>= 4, 4,IF(SUMIF(Table13261720912[Type of Care], \"QI\", Table13261720912[[Duration ]])<= 3, SUMIF(Table13261720912[Type of Care], \"QI\", Table13261720912[[Duration ]]), 0))))> 90)","v":false}]
[null,null,"",null,null,null,null,{"$f":"IF( B107 > $D$83+14, SUMIFS($G$86:G107, $D$86:D107,\"Direct/Indirect/Clinical Administration\", $B$86:B107,\">\"&$D$83 + 14) + ((IF(SUMIF(Table13261720912[Type of Care], \"QI\", Table13261720912[[Duration ]])>= 4, 4,IF(SUMIF(Table13261720912[Type of Care], \"QI\", Table13261720912[[Duration ]])<= 3, SUMIF(Table13261720912[Type of Care], \"QI\", Table13261720912[[Duration ]]), 0))))  > 90, SUMIFS($G$86:G107, $D$86:D107,\"Direct/Indirect/Clinical Administration\",  $B$86:B107,\"<=\"&$D$83 + 14)+ ((IF(SUMIF(Table13261720912[Type of Care], \"QI\", Table13261720912[[Duration ]])>= 4, 4,IF(SUMIF(Table13261720912[Type of Care], \"QI\", Table13261720912[[Duration ]])<= 3, SUMIF(Table13261720912[Type of Care], \"QI\", Table13261720912[[Duration ]]), 0))))> 90)","v":false}]
[null,null,"",null,null,null,null,{"$f":"IF( B108 > $D$83+14, SUMIFS($G$86:G108, $D$86:D108,\"Direct/Indirect/Clinical Administration\", $B$86:B108,\">\"&$D$83 + 14) + ((IF(SUMIF(Table13261720912[Type of Care], \"QI\", Table13261720912[[Duration ]])>= 4, 4,IF(SUMIF(Table13261720912[Type of Care], \"QI\", Table13261720912[[Duration ]])<= 3, SUMIF(Table13261720912[Type of Care], \"QI\", Table13261720912[[Duration ]]), 0))))  > 90, SUMIFS($G$86:G108, $D$86:D108,\"Direct/Indirect/Clinical Administration\",  $B$86:B108,\"<=\"&$D$83 + 14)+ ((IF(SUMIF(Table13261720912[Type of Care], \"QI\", Table13261720912[[Duration ]])>= 4, 4,IF(SUMIF(Table13261720912[Type of Care], \"QI\", Table13261720912[[Duration ]])<= 3, SUMIF(Table13261720912[Type of Care], \"QI\", Table13261720912[[Duration ]]), 0))))> 90)","v":false}]
[null,null,"",null,null,null,null,{"$f":"IF( B109 > $D$83+14, SUMIFS($G$86:G109, $D$86:D109,\"Direct/Indirect/Clinical Administration\", $B$86:B109,\">\"&$D$83 + 14) + ((IF(SUMIF(Table13261720912[Type of Care], \"QI\", Table13261720912[[Duration ]])>= 4, 4,IF(SUMIF(Table13261720912[Type of Care], \"QI\", Table13261720912[[Duration ]])<= 3, SUMIF(Table13261720912[Type of Care], \"QI\", Table13261720912[[Duration ]]), 0))))  > 90, SUMIFS($G$86:G109, $D$86:D109,\"Direct/Indirect/Clinical Administration\",  $B$86:B109,\"<=\"&$D$83 + 14)+ ((IF(SUMIF(Table13261720912[Type of Care], \"QI\", Table13261720912[[Duration ]])>= 4, 4,IF(SUMIF(Table13261720912[Type of Care], \"QI\", Table13261720912[[Duration ]])<= 3, SUMIF(Table13261720912[Type of Care], \"QI\", Table13261720912[[Duration ]]), 0))))> 90)","v":false}]
[null,null,"",null,null,null,null,{"$f":"IF( B110 > $D$83+14, SUMIFS($G$86:G110, $D$86:D110,\"Direct/Indirect/Clinical Administration\", $B$86:B110,\">\"&$D$83 + 14) + ((IF(SUMIF(Table13261720912[Type of Care], \"QI\", Table13261720912[[Duration ]])>= 4, 4,IF(SUMIF(Table13261720912[Type of Care], \"QI\", Table13261720912[[Duration ]])<= 3, SUMIF(Table13261720912[Type of Care], \"QI\", Table13261720912[[Duration ]]), 0))))  > 90, SUMIFS($G$86:G110, $D$86:D110,\"Direct/Indirect/Clinical Administration\",  $B$86:B110,\"<=\"&$D$83 + 14)+ ((IF(SUMIF(Table13261720912[Type of Care], \"QI\", Table13261720912[[Duration ]])>= 4, 4,IF(SUMIF(Table13261720912[Type of Care], \"QI\", Table13261720912[[Duration ]])<= 3, SUMIF(Table13261720912[Type of Care], \"QI\", Table13261720912[[Duration ]]), 0))))> 90)","v":false}]
[null,null,"",null,null,null,null,{"$f":"IF( B111 > $D$83+14, SUMIFS($G$86:G111, $D$86:D111,\"Direct/Indirect/Clinical Administration\", $B$86:B111,\">\"&$D$83 + 14) + ((IF(SUMIF(Table13261720912[Type of Care], \"QI\", Table13261720912[[Duration ]])>= 4, 4,IF(SUMIF(Table13261720912[Type of Care], \"QI\", Table13261720912[[Duration ]])<= 3, SUMIF(Table13261720912[Type of Care], \"QI\", Table13261720912[[Duration ]]), 0))))  > 90, SUMIFS($G$86:G111, $D$86:D111,\"Direct/Indirect/Clinical Administration\",  $B$86:B111,\"<=\"&$D$83 + 14)+ ((IF(SUMIF(Table13261720912[Type of Care], \"QI\", Table13261720912[[Duration ]])>= 4, 4,IF(SUMIF(Table13261720912[Type of Care], \"QI\", Table13261720912[[Duration ]])<= 3, SUMIF(Table13261720912[Type of Care], \"QI\", Table13261720912[[Duration ]]), 0))))> 90)","v":false}]
[null,null,"",null,null,null,null,{"$f":"IF( B112 > $D$83+14, SUMIFS($G$86:G112, $D$86:D112,\"Direct/Indirect/Clinical Administration\", $B$86:B112,\">\"&$D$83 + 14) + ((IF(SUMIF(Table13261720912[Type of Care], \"QI\", Table13261720912[[Duration ]])>= 4, 4,IF(SUMIF(Table13261720912[Type of Care], \"QI\", Table13261720912[[Duration ]])<= 3, SUMIF(Table13261720912[Type of Care], \"QI\", Table13261720912[[Duration ]]), 0))))  > 90, SUMIFS($G$86:G112, $D$86:D112,\"Direct/Indirect/Clinical Administration\",  $B$86:B112,\"<=\"&$D$83 + 14)+ ((IF(SUMIF(Table13261720912[Type of Care], \"QI\", Table13261720912[[Duration ]])>= 4, 4,IF(SUMIF(Table13261720912[Type of Care], \"QI\", Table13261720912[[Duration ]])<= 3, SUMIF(Table13261720912[Type of Care], \"QI\", Table13261720912[[Duration ]]), 0))))> 90)","v":false}]
[null,null,"",null,null,null,null,{"$f":"IF( B113 > $D$83+14, SUMIFS($G$86:G113, $D$86:D113,\"Direct/Indirect/Clinical Administration\", $B$86:B113,\">\"&$D$83 + 14) + ((IF(SUMIF(Table13261720912[Type of Care], \"QI\", Table13261720912[[Duration ]])>= 4, 4,IF(SUMIF(Table13261720912[Type of Care], \"QI\", Table13261720912[[Duration ]])<= 3, SUMIF(Table13261720912[Type of Care], \"QI\", Table13261720912[[Duration ]]), 0))))  > 90, SUMIFS($G$86:G113, $D$86:D113,\"Direct/Indirect/Clinical Administration\",  $B$86:B113,\"<=\"&$D$83 + 14)+ ((IF(SUMIF(Table13261720912[Type of Care], \"QI\", Table13261720912[[Duration ]])>= 4, 4,IF(SUMIF(Table13261720912[Type of Care], \"QI\", Table13261720912[[Duration ]])<= 3, SUMIF(Table13261720912[Type of Care], \"QI\", Table13261720912[[Duration ]]), 0))))> 90)","v":false}]
[null,null,"",null,null,null,null,{"$f":"IF( B114 > $D$83+14, SUMIFS($G$86:G114, $D$86:D114,\"Direct/Indirect/Clinical Administration\", $B$86:B114,\">\"&$D$83 + 14) + ((IF(SUMIF(Table13261720912[Type of Care], \"QI\", Table13261720912[[Duration ]])>= 4, 4,IF(SUMIF(Table13261720912[Type of Care], \"QI\", Table13261720912[[Duration ]])<= 3, SUMIF(Table13261720912[Type of Care], \"QI\", Table13261720912[[Duration ]]), 0))))  > 90, SUMIFS($G$86:G114, $D$86:D114,\"Direct/Indirect/Clinical Administration\",  $B$86:B114,\"<=\"&$D$83 + 14)+ ((IF(SUMIF(Table13261720912[Type of Care], \"QI\", Table13261720912[[Duration ]])>= 4, 4,IF(SUMIF(Table13261720912[Type of Care], \"QI\", Table13261720912[[Duration ]])<= 3, SUMIF(Table13261720912[Type of Care], \"QI\", Table13261720912[[Duration ]]), 0))))> 90)","v":false}]
[null,null,{"$f":"IF(B115=\"\", \"\", B115)","v":""},null,null,"Total Contract Hours",{"$f":"(SUMIF(Table13261720912[Type of Care], \"Direct/Indirect/Clinical Administration\",Table13261720912[[Duration ]]))","v":0},"CT3"]
[null,null,null,null,null,"Total Included QI Hours",{"$f":"(IF(SUMIF(Table13261720912[Type of Care], \"QI\", Table13261720912[[Duration ]])>= 4, 4,IF(SUMIF(Table13261720912[Type of Care], \"QI\", Table13261720912[[Duration ]])<= 3, SUMIF(Table13261720912[Type of Care], \"QI\", Table13261720912[[Duration ]]), 0)))","v":0},"QI3"]
[null,null,null,null,null,"Total Excluded Hours",{"$f":"G118+G119","v":0},"EX3"]
[null,null,null,null,null,"         Excluded Contract Hours",{"$f":"(SUMIF(Table13261720912[Type of Care], \"Third Party/Specialist FFS\",Table13261720912[[Duration ]])) + (SUMIF(Table13261720912[Type of Care], \"Break (>15 Minutes)\", Table13261720912[[Duration ]]))","v":0},"EXC3"]
[null,null,null,null,null,"      Excluded QI Hours",{"$f":"(SUMIF(Table13261720912[Type of Care], \"QI\", Table13261720912[[Duration ]]) - (IF(SUMIF(Table13261720912[Type of Care], \"QI\", Table13261720912[[Duration ]])>= 4, 4,IF(SUMIF(Table13261720912[Type of Care], \"QI\", Table13261720912[[Duration ]])<= 3, SUMIF(Table13261720912[Type of Care], \"QI\", Table13261720912[[Duration ]]), 0))))","v":0},"EXQI3"]
[null,null,{"$f":"IF(B120=\"\", \"\", B120)","v":""},null,null,"Hours Above 90hr/semi-monthly",{"$f":"  (IF(SUMIFS(Table13261720912[[Duration ]],Table13261720912[Date (YYYY-MM-DD)], \">\"&$D$83+14, Table13261720912[Type of Care], \"Direct/Indirect/Clinical Administration\")>= 90, (SUMIFS(Table13261720912[[Duration ]],Table13261720912[Date (YYYY-MM-DD)], \">\"&$D$83+14, Table13261720912[Type of Care], \"Direct/Indirect/Clinical Administration\")+ (IF(SUMIF(Table13261720912[Type of Care], \"QI\", Table13261720912[[Duration ]])>= 4, 4,IF(SUMIF(Table13261720912[Type of Care], \"QI\", Table13261720912[[Duration ]])<= 3, SUMIF(Table13261720912[Type of Care], \"QI\",Table13261720912[[Duration ]]), 0))) -90))) + (IF(SUMIFS(Table13261720912[[Duration ]],Table13261720912[Date (YYYY-MM-DD)], \"<=\"&$D$83+14, Table13261720912[Type of Care], \"Direct/Indirect/Clinical Administration\")>= 90, (SUMIFS(Table13261720912[[Duration ]],Table13261720912[Date (YYYY-MM-DD)], \"<=\"&$D$83+14, Table13261720912[Type of Care], \"Direct/Indirect/Clinical Administration\")+ (IF(SUMIF(Table13261720912[Type of Care], \"QI\", Table13261720912[[Duration ]])>= 4, 4,IF(SUMIF(Table13261720912[Type of Care], \"QI\", Table13261720912[[Duration ]])<= 3, SUMIF(Table13261720912[Type of Care], \"QI\",Table13261720912[[Duration ]]), 0))) -90)))","v":0},"A903"]

{"sheet":"Physician 6","index":6,"n_rows":120,"n_cols":8,"rows_kept":120,"cut":false,"hidden":false,"merged":[]}
[]
[null,"[Physician Name]"]
[null,"Practitioner #:",0]
[null,"Annual Rate: ",0]
[null,"Qrt. Disbursement: ",0]
[null,null,"Jan - Mar"]
[null,"Total Contract \nHours","Total Included \nQI Hours","Excluded Contract \nHours"]
[null,{"$f":"G35+G75+G115","v":0},{"$f":"G36+G76+G116","v":0},{"$f":"G37+G77+G117","v":0},null,null,null,"Totals"]
[]
[null,{"$f":"IF(Clinic!C5=\"Jan - Mar\", \"January\", IF(Clinic!C5= \"Apr - June\", \"April\", IF(Clinic!C5=\"July - Sept\", \"July\", IF(Clinic!C5=\" Oct - Dec\", \"October\"))))","v":"January"},{"$f":"Clinic!C6","v":2021},{"$f":"DATE(YEAR(B13),MONTH(DATEVALUE(B10&\"1\")),1)","v":"1900-01-01"},null,null,null,"Month1"]
[]
[null,"Date (YYYY-MM-DD)","Day ","Type of Care","Start Time AM/PM","End Time AM/PM","Duration","FALSE/TRUE"]
[null,null,{"$f":"IF(B13=\"\", \"\", B13)","v":""},null,null,null,null,{"$f":"IF( B13 > $D$10+14, SUMIFS($G$13:G13, $D$13:D13,\"Direct/Indirect/Clinical Administration\", $B$13:B13,\">\"&$D$10 + 14) + ((IF(SUMIF(Table13151871013[Type of Care], \"QI\", Table13151871013[Duration])>= 4, 4,IF(SUMIF(Table13151871013[Type of Care], \"QI\", Table13151871013[Duration])<= 3, SUMIF(Table13151871013[Type of Care], \"QI\", Table13151871013[Duration]), 0))))  > 90, SUMIFS($G$13:G13, $D$13:D13,\"Direct/Indirect/Clinical Administration\",  $B$13:B13,\"<=\"&$D$10 + 14)+ ((IF(SUMIF(Table13151871013[Type of Care], \"QI\", Table13151871013[Duration])>= 4, 4,IF(SUMIF(Table13151871013[Type of Care], \"QI\", Table13151871013[Duration])<= 3, SUMIF(Table13151871013[Type of Care], \"QI\", Table13151871013[Duration]), 0))))> 90)","v":false}]
[null,null,{"$f":"IF(B14=\"\", \"\", B14)","v":""},null,null,null,null,{"$f":"IF( B14 > $D$10+14, SUMIFS($G$13:G14, $D$13:D14,\"Direct/Indirect/Clinical Administration\", $B$13:B14,\">\"&$D$10 + 14) + ((IF(SUMIF(Table13151871013[Type of Care], \"QI\", Table13151871013[Duration])>= 4, 4,IF(SUMIF(Table13151871013[Type of Care], \"QI\", Table13151871013[Duration])<= 3, SUMIF(Table13151871013[Type of Care], \"QI\", Table13151871013[Duration]), 0))))  > 90, SUMIFS($G$13:G14, $D$13:D14,\"Direct/Indirect/Clinical Administration\",  $B$13:B14,\"<=\"&$D$10 + 14)+ ((IF(SUMIF(Table13151871013[Type of Care], \"QI\", Table13151871013[Duration])>= 4, 4,IF(SUMIF(Table13151871013[Type of Care], \"QI\", Table13151871013[Duration])<= 3, SUMIF(Table13151871013[Type of Care], \"QI\", Table13151871013[Duration]), 0))))> 90)","v":false}]
[null,null,"",null,null,null,null,{"$f":"IF( B15 > $D$10+14, SUMIFS($G$13:G15, $D$13:D15,\"Direct/Indirect/Clinical Administration\", $B$13:B15,\">\"&$D$10 + 14) + ((IF(SUMIF(Table13151871013[Type of Care], \"QI\", Table13151871013[Duration])>= 4, 4,IF(SUMIF(Table13151871013[Type of Care], \"QI\", Table13151871013[Duration])<= 3, SUMIF(Table13151871013[Type of Care], \"QI\", Table13151871013[Duration]), 0))))  > 90, SUMIFS($G$13:G15, $D$13:D15,\"Direct/Indirect/Clinical Administration\",  $B$13:B15,\"<=\"&$D$10 + 14)+ ((IF(SUMIF(Table13151871013[Type of Care], \"QI\", Table13151871013[Duration])>= 4, 4,IF(SUMIF(Table13151871013[Type of Care], \"QI\", Table13151871013[Duration])<= 3, SUMIF(Table13151871013[Type of Care], \"QI\", Table13151871013[Duration]), 0))))> 90)","v":false}]
[null,null,"",null,null,null,null,{"$f":"IF( B16 > $D$10+14, SUMIFS($G$13:G16, $D$13:D16,\"Direct/Indirect/Clinical Administration\", $B$13:B16,\">\"&$D$10 + 14) + ((IF(SUMIF(Table13151871013[Type of Care], \"QI\", Table13151871013[Duration])>= 4, 4,IF(SUMIF(Table13151871013[Type of Care], \"QI\", Table13151871013[Duration])<= 3, SUMIF(Table13151871013[Type of Care], \"QI\", Table13151871013[Duration]), 0))))  > 90, SUMIFS($G$13:G16, $D$13:D16,\"Direct/Indirect/Clinical Administration\",  $B$13:B16,\"<=\"&$D$10 + 14)+ ((IF(SUMIF(Table13151871013[Type of Care], \"QI\", Table13151871013[Duration])>= 4, 4,IF(SUMIF(Table13151871013[Type of Care], \"QI\", Table13151871013[Duration])<= 3, SUMIF(Table13151871013[Type of Care], \"QI\", Table13151871013[Duration]), 0))))> 90)","v":false}]
[null,null,"",null,null,null,null,{"$f":"IF( B17 > $D$10+14, SUMIFS($G$13:G17, $D$13:D17,\"Direct/Indirect/Clinical Administration\", $B$13:B17,\">\"&$D$10 + 14) + ((IF(SUMIF(Table13151871013[Type of Care], \"QI\", Table13151871013[Duration])>= 4, 4,IF(SUMIF(Table13151871013[Type of Care], \"QI\", Table13151871013[Duration])<= 3, SUMIF(Table13151871013[Type of Care], \"QI\", Table13151871013[Duration]), 0))))  > 90, SUMIFS($G$13:G17, $D$13:D17,\"Direct/Indirect/Clinical Administration\",  $B$13:B17,\"<=\"&$D$10 + 14)+ ((IF(SUMIF(Table13151871013[Type of Care], \"QI\", Table13151871013[Duration])>= 4, 4,IF(SUMIF(Table13151871013[Type of Care], \"QI\", Table13151871013[Duration])<= 3, SUMIF(Table13151871013[Type of Care], \"QI\", Table13151871013[Duration]), 0))))> 90)","v":false}]
[null,null,"",null,null,null,null,{"$f":"IF( B18 > $D$10+14, SUMIFS($G$13:G18, $D$13:D18,\"Direct/Indirect/Clinical Administration\", $B$13:B18,\">\"&$D$10 + 14) + ((IF(SUMIF(Table13151871013[Type of Care], \"QI\", Table13151871013[Duration])>= 4, 4,IF(SUMIF(Table13151871013[Type of Care], \"QI\", Table13151871013[Duration])<= 3, SUMIF(Table13151871013[Type of Care], \"QI\", Table13151871013[Duration]), 0))))  > 90, SUMIFS($G$13:G18, $D$13:D18,\"Direct/Indirect/Clinical Administration\",  $B$13:B18,\"<=\"&$D$10 + 14)+ ((IF(SUMIF(Table13151871013[Type of Care], \"QI\", Table13151871013[Duration])>= 4, 4,IF(SUMIF(Table13151871013[Type of Care], \"QI\", Table13151871013[Duration])<= 3, SUMIF(Table13151871013[Type of Care], \"QI\", Table13151871013[Duration]), 0))))> 90)","v":false}]
[null,null,"",null,null,null,null,{"$f":"IF( B19 > $D$10+14, SUMIFS($G$13:G19, $D$13:D19,\"Direct/Indirect/Clinical Administration\", $B$13:B19,\">\"&$D$10 + 14) + ((IF(SUMIF(Table13151871013[Type of Care], \"QI\", Table13151871013[Duration])>= 4, 4,IF(SUMIF(Table13151871013[Type of Care], \"QI\", Table13151871013[Duration])<= 3, SUMIF(Table13151871013[Type of Care], \"QI\", Table13151871013[Duration]), 0))))  > 90, SUMIFS($G$13:G19, $D$13:D19,\"Direct/Indirect/Clinical Administration\",  $B$13:B19,\"<=\"&$D$10 + 14)+ ((IF(SUMIF(Table13151871013[Type of Care], \"QI\", Table13151871013[Duration])>= 4, 4,IF(SUMIF(Table13151871013[Type of Care], \"QI\", Table13151871013[Duration])<= 3, SUMIF(Table13151871013[Type of Care], \"QI\", Table13151871013[Duration]), 0))))> 90)","v":false}]
[null,null,"",null,null,null,null,{"$f":"IF( B20 > $D$10+14, SUMIFS($G$13:G20, $D$13:D20,\"Direct/Indirect/Clinical Administration\", $B$13:B20,\">\"&$D$10 + 14) + ((IF(SUMIF(Table13151871013[Type of Care], \"QI\", Table13151871013[Duration])>= 4, 4,IF(SUMIF(Table13151871013[Type of Care], \"QI\", Table13151871013[Duration])<= 3, SUMIF(Table13151871013[Type of Care], \"QI\", Table13151871013[Duration]), 0))))  > 90, SUMIFS($G$13:G20, $D$13:D20,\"Direct/Indirect/Clinical Administration\",  $B$13:B20,\"<=\"&$D$10 + 14)+ ((IF(SUMIF(Table13151871013[Type of Care], \"QI\", Table13151871013[Duration])>= 4, 4,IF(SUMIF(Table13151871013[Type of Care], \"QI\", Table13151871013[Duration])<= 3, SUMIF(Table13151871013[Type of Care], \"QI\", Table13151871013[Duration]), 0))))> 90)","v":false}]
[null,null,"",null,null,null,null,{"$f":"IF( B21 > $D$10+14, SUMIFS($G$13:G21, $D$13:D21,\"Direct/Indirect/Clinical Administration\", $B$13:B21,\">\"&$D$10 + 14) + ((IF(SUMIF(Table13151871013[Type of Care], \"QI\", Table13151871013[Duration])>= 4, 4,IF(SUMIF(Table13151871013[Type of Care], \"QI\", Table13151871013[Duration])<= 3, SUMIF(Table13151871013[Type of Care], \"QI\", Table13151871013[Duration]), 0))))  > 90, SUMIFS($G$13:G21, $D$13:D21,\"Direct/Indirect/Clinical Administration\",  $B$13:B21,\"<=\"&$D$10 + 14)+ ((IF(SUMIF(Table13151871013[Type of Care], \"QI\", Table13151871013[Duration])>= 4, 4,IF(SUMIF(Table13151871013[Type of Care], \"QI\", Table13151871013[Duration])<= 3, SUMIF(Table13151871013[Type of Care], \"QI\", Table13151871013[Duration]), 0))))> 90)","v":false}]
[null,null,"",null,null,null,null,{"$f":"IF( B22 > $D$10+14, SUMIFS($G$13:G22, $D$13:D22,\"Direct/Indirect/Clinical Administration\", $B$13:B22,\">\"&$D$10 + 14) + ((IF(SUMIF(Table13151871013[Type of Care], \"QI\", Table13151871013[Duration])>= 4, 4,IF(SUMIF(Table13151871013[Type of Care], \"QI\", Table13151871013[Duration])<= 3, SUMIF(Table13151871013[Type of Care], \"QI\", Table13151871013[Duration]), 0))))  > 90, SUMIFS($G$13:G22, $D$13:D22,\"Direct/Indirect/Clinical Administration\",  $B$13:B22,\"<=\"&$D$10 + 14)+ ((IF(SUMIF(Table13151871013[Type of Care], \"QI\", Table13151871013[Duration])>= 4, 4,IF(SUMIF(Table13151871013[Type of Care], \"QI\", Table13151871013[Duration])<= 3, SUMIF(Table13151871013[Type of Care], \"QI\", Table13151871013[Duration]), 0))))> 90)","v":false}]
[null,null,"",null,null,null,null,{"$f":"IF( B23 > $D$10+14, SUMIFS($G$13:G23, $D$13:D23,\"Direct/Indirect/Clinical Administration\", $B$13:B23,\">\"&$D$10 + 14) + ((IF(SUMIF(Table13151871013[Type of Care], \"QI\", Table13151871013[Duration])>= 4, 4,IF(SUMIF(Table13151871013[Type of Care], \"QI\", Table13151871013[Duration])<= 3, SUMIF(Table13151871013[Type of Care], \"QI\", Table13151871013[Duration]), 0))))  > 90, SUMIFS($G$13:G23, $D$13:D23,\"Direct/Indirect/Clinical Administration\",  $B$13:B23,\"<=\"&$D$10 + 14)+ ((IF(SUMIF(Table13151871013[Type of Care], \"QI\", Table13151871013[Duration])>= 4, 4,IF(SUMIF(Table13151871013[Type of Care], \"QI\", Table13151871013[Duration])<= 3, SUMIF(Table13151871013[Type of Care], \"QI\", Table13151871013[Duration]), 0))))> 90)","v":false}]
[null,null,"",null,null,null,null,{"$f":"IF( B24 > $D$10+14, SUMIFS($G$13:G24, $D$13:D24,\"Direct/Indirect/Clinical Administration\", $B$13:B24,\">\"&$D$10 + 14) + ((IF(SUMIF(Table13151871013[Type of Care], \"QI\", Table13151871013[Duration])>= 4, 4,IF(SUMIF(Table13151871013[Type of Care], \"QI\", Table13151871013[Duration])<= 3, SUMIF(Table13151871013[Type of Care], \"QI\", Table13151871013[Duration]), 0))))  > 90, SUMIFS($G$13:G24, $D$13:D24,\"Direct/Indirect/Clinical Administration\",  $B$13:B24,\"<=\"&$D$10 + 14)+ ((IF(SUMIF(Table13151871013[Type of Care], \"QI\", Table13151871013[Duration])>= 4, 4,IF(SUMIF(Table13151871013[Type of Care], \"QI\", Table13151871013[Duration])<= 3, SUMIF(Table13151871013[Type of Care], \"QI\", Table13151871013[Duration]), 0))))> 90)","v":false}]
[null,null,"",null,null,null,null,{"$f":"IF( B25 > $D$10+14, SUMIFS($G$13:G25, $D$13:D25,\"Direct/Indirect/Clinical Administration\", $B$13:B25,\">\"&$D$10 + 14) + ((IF(SUMIF(Table13151871013[Type of Care], \"QI\", Table13151871013[Duration])>= 4, 4,IF(SUMIF(Table13151871013[Type of Care], \"QI\", Table13151871013[Duration])<= 3, SUMIF(Table13151871013[Type of Care], \"QI\", Table13151871013[Duration]), 0))))  > 90, SUMIFS($G$13:G25, $D$13:D25,\"Direct/Indirect/Clinical Administration\",  $B$13:B25,\"<=\"&$D$10 + 14)+ ((IF(SUMIF(Table13151871013[Type of Care], \"QI\", Table13151871013[Duration])>= 4, 4,IF(SUMIF(Table13151871013[Type of Care], \"QI\", Table13151871013[Duration])<= 3, SUMIF(Table13151871013[Type of Care], \"QI\", Table13151871013[Duration]), 0))))> 90)","v":false}]
[null,null,"",null,null,null,null,{"$f":"IF( B26 > $D$10+14, SUMIFS($G$13:G26, $D$13:D26,\"Direct/Indirect/Clinical Administration\", $B$13:B26,\">\"&$D$10 + 14) + ((IF(SUMIF(Table13151871013[Type of Care], \"QI\", Table13151871013[Duration])>= 4, 4,IF(SUMIF(Table13151871013[Type of Care], \"QI\", Table13151871013[Duration])<= 3, SUMIF(Table13151871013[Type of Care], \"QI\", Table13151871013[Duration]), 0))))  > 90, SUMIFS($G$13:G26, $D$13:D26,\"Direct/Indirect/Clinical Administration\",  $B$13:B26,\"<=\"&$D$10 + 14)+ ((IF(SUMIF(Table13151871013[Type of Care], \"QI\", Table13151871013[Duration])>= 4, 4,IF(SUMIF(Table13151871013[Type of Care], \"QI\", Table13151871013[Duration])<= 3, SUMIF(Table13151871013[Type of Care], \"QI\", Table13151871013[Duration]), 0))))> 90)","v":false}]
[null,null,"",null,null,null,null,{"$f":"IF( B27 > $D$10+14, SUMIFS($G$13:G27, $D$13:D27,\"Direct/Indirect/Clinical Administration\", $B$13:B27,\">\"&$D$10 + 14) + ((IF(SUMIF(Table13151871013[Type of Care], \"QI\", Table13151871013[Duration])>= 4, 4,IF(SUMIF(Table13151871013[Type of Care], \"QI\", Table13151871013[Duration])<= 3, SUMIF(Table13151871013[Type of Care], \"QI\", Table13151871013[Duration]), 0))))  > 90, SUMIFS($G$13:G27, $D$13:D27,\"Direct/Indirect/Clinical Administration\",  $B$13:B27,\"<=\"&$D$10 + 14)+ ((IF(SUMIF(Table13151871013[Type of Care], \"QI\", Table13151871013[Duration])>= 4, 4,IF(SUMIF(Table13151871013[Type of Care], \"QI\", Table13151871013[Duration])<= 3, SUMIF(Table13151871013[Type of Care], \"QI\", Table13151871013[Duration]), 0))))> 90)","v":false}]
[null,null,"",null,null,null,null,{"$f":"IF( B28 > $D$10+14, SUMIFS($G$13:G28, $D$13:D28,\"Direct/Indirect/Clinical Administration\", $B$13:B28,\">\"&$D$10 + 14) + ((IF(SUMIF(Table13151871013[Type of Care], \"QI\", Table13151871013[Duration])>= 4, 4,IF(SUMIF(Table13151871013[Type of Care], \"QI\", Table13151871013[Duration])<= 3, SUMIF(Table13151871013[Type of Care], \"QI\", Table13151871013[Duration]), 0))))  > 90, SUMIFS($G$13:G28, $D$13:D28,\"Direct/Indirect/Clinical Administration\",  $B$13:B28,\"<=\"&$D$10 + 14)+ ((IF(SUMIF(Table13151871013[Type of Care], \"QI\", Table13151871013[Duration])>= 4, 4,IF(SUMIF(Table13151871013[Type of Care], \"QI\", Table13151871013[Duration])<= 3, SUMIF(Table13151871013[Type of Care], \"QI\", Table13151871013[Duration]), 0))))> 90)","v":false}]
[null,null,"",null,null,null,null,{"$f":"IF( B29 > $D$10+14, SUMIFS($G$13:G29, $D$13:D29,\"Direct/Indirect/Clinical Administration\", $B$13:B29,\">\"&$D$10 + 14) + ((IF(SUMIF(Table13151871013[Type of Care], \"QI\", Table13151871013[Duration])>= 4, 4,IF(SUMIF(Table13151871013[Type of Care], \"QI\", Table13151871013[Duration])<= 3, SUMIF(Table13151871013[Type of Care], \"QI\", Table13151871013[Duration]), 0))))  > 90, SUMIFS($G$13:G29, $D$13:D29,\"Direct/Indirect/Clinical Administration\",  $B$13:B29,\"<=\"&$D$10 + 14)+ ((IF(SUMIF(Table13151871013[Type of Care], \"QI\", Table13151871013[Duration])>= 4, 4,IF(SUMIF(Table13151871013[Type of Care], \"QI\", Table13151871013[Duration])<= 3, SUMIF(Table13151871013[Type of Care], \"QI\", Table13151871013[Duration]), 0))))> 90)","v":false}]
[null,null,"",null,null,null,null,{"$f":"IF( B30 > $D$10+14, SUMIFS($G$13:G30, $D$13:D30,\"Direct/Indirect/Clinical Administration\", $B$13:B30,\">\"&$D$10 + 14) + ((IF(SUMIF(Table13151871013[Type of Care], \"QI\", Table13151871013[Duration])>= 4, 4,IF(SUMIF(Table13151871013[Type of Care], \"QI\", Table13151871013[Duration])<= 3, SUMIF(Table13151871013[Type of Care], \"QI\", Table13151871013[Duration]), 0))))  > 90, SUMIFS($G$13:G30, $D$13:D30,\"Direct/Indirect/Clinical Administration\",  $B$13:B30,\"<=\"&$D$10 + 14)+ ((IF(SUMIF(Table13151871013[Type of Care], \"QI\", Table13151871013[Duration])>= 4, 4,IF(SUMIF(Table13151871013[Type of Care], \"QI\", Table13151871013[Duration])<= 3, SUMIF(Table13151871013[Type of Care], \"QI\", Table13151871013[Duration]), 0))))> 90)","v":false}]
[null,null,"",null,null,null,null,{"$f":"IF( B31 > $D$10+14, SUMIFS($G$13:G31, $D$13:D31,\"Direct/Indirect/Clinical Administration\", $B$13:B31,\">\"&$D$10 + 14) + ((IF(SUMIF(Table13151871013[Type of Care], \"QI\", Table13151871013[Duration])>= 4, 4,IF(SUMIF(Table13151871013[Type of Care], \"QI\", Table13151871013[Duration])<= 3, SUMIF(Table13151871013[Type of Care], \"QI\", Table13151871013[Duration]), 0))))  > 90, SUMIFS($G$13:G31, $D$13:D31,\"Direct/Indirect/Clinical Administration\",  $B$13:B31,\"<=\"&$D$10 + 14)+ ((IF(SUMIF(Table13151871013[Type of Care], \"QI\", Table13151871013[Duration])>= 4, 4,IF(SUMIF(Table13151871013[Type of Care], \"QI\", Table13151871013[Duration])<= 3, SUMIF(Table13151871013[Type of Care], \"QI\", Table13151871013[Duration]), 0))))> 90)","v":false}]
[null,null,"",null,null,null,null,{"$f":"IF( B32 > $D$10+14, SUMIFS($G$13:G32, $D$13:D32,\"Direct/Indirect/Clinical Administration\", $B$13:B32,\">\"&$D$10 + 14) + ((IF(SUMIF(Table13151871013[Type of Care], \"QI\", Table13151871013[Duration])>= 4, 4,IF(SUMIF(Table13151871013[Type of Care], \"QI\", Table13151871013[Duration])<= 3, SUMIF(Table13151871013[Type of Care], \"QI\", Table13151871013[Duration]), 0))))  > 90, SUMIFS($G$13:G32, $D$13:D32,\"Direct/Indirect/Clinical Administration\",  $B$13:B32,\"<=\"&$D$10 + 14)+ ((IF(SUMIF(Table13151871013[Type of Care], \"QI\", Table13151871013[Duration])>= 4, 4,IF(SUMIF(Table13151871013[Type of Care], \"QI\", Table13151871013[Duration])<= 3, SUMIF(Table13151871013[Type of Care], \"QI\", Table13151871013[Duration]), 0))))> 90)","v":false}]
[null,null,"",null,null,null,null,{"$f":"IF( B33 > $D$10+14, SUMIFS($G$13:G33, $D$13:D33,\"Direct/Indirect/Clinical Administration\", $B$13:B33,\">\"&$D$10 + 14) + ((IF(SUMIF(Table13151871013[Type of Care], \"QI\", Table13151871013[Duration])>= 4, 4,IF(SUMIF(Table13151871013[Type of Care], \"QI\", Table13151871013[Duration])<= 3, SUMIF(Table13151871013[Type of Care], \"QI\", Table13151871013[Duration]), 0))))  > 90, SUMIFS($G$13:G33, $D$13:D33,\"Direct/Indirect/Clinical Administration\",  $B$13:B33,\"<=\"&$D$10 + 14)+ ((IF(SUMIF(Table13151871013[Type of Care], \"QI\", Table13151871013[Duration])>= 4, 4,IF(SUMIF(Table13151871013[Type of Care], \"QI\", Table13151871013[Duration])<= 3, SUMIF(Table13151871013[Type of Care], \"QI\", Table13151871013[Duration]), 0))))> 90)","v":false}]
[null,null,"",null,null,null,null,{"$f":"IF( B34 > $D$10+14, SUMIFS($G$13:G34, $D$13:D34,\"Direct/Indirect/Clinical Administration\", $B$13:B34,\">\"&$D$10 + 14) + ((IF(SUMIF(Table13151871013[Type of Care], \"QI\", Table13151871013[Duration])>= 4, 4,IF(SUMIF(Table13151871013[Type of Care], \"QI\", Table13151871013[Duration])<= 3, SUMIF(Table13151871013[Type of Care], \"QI\", Table13151871013[Duration]), 0))))  > 90, SUMIFS($G$13:G34, $D$13:D34,\"Direct/Indirect/Clinical Administration\",  $B$13:B34,\"<=\"&$D$10 + 14)+ ((IF(SUMIF(Table13151871013[Type of Care], \"QI\", Table13151871013[Duration])>= 4, 4,IF(SUMIF(Table13151871013[Type of Care], \"QI\", Table13151871013[Duration])<= 3, SUMIF(Table13151871013[Type of Care], \"QI\", Table13151871013[Duration]), 0))))> 90)","v":false}]
[null,null,{"$f":"IF(B35=\"\", \"\", B35)","v":""},null,null,"Total Contract Hours",{"$f":"(SUMIF(Table13151871013[Type of Care], \"Direct/Indirect/Clinical Administration\",Table13151871013[Duration]))","v":0},"CT1"]
[null,null,null,null,null,"Total Included QI Hours",{"$f":"(IF(SUMIF(Table13151871013[Type of Care], \"QI\", Table13151871013[Duration])>= 4, 4,IF(SUMIF(Table13151871013[Type of Care], \"QI\", Table13151871013[Duration])<= 3, SUMIF(Table13151871013[Type of Care], \"QI\", Table13151871013[Duration]), 0)))","v":0},"QI1"]
[null,null,null,null,null,"Total Excluded Hours",{"$f":"G38+G39","v":0},"EX1"]
[null,null,null,null,null,"         Excluded Contract Hours",{"$f":"(SUMIF(Table13151871013[Type of Care], \"Third Party/Specialist FFS\",Table13151871013[Duration])) + (SUMIF(Table13151871013[Type of Care], \"Break (>15 Minutes)\", Table13151871013[Duration]))","v":0},"EXC1"]
[null,null,null,null,null,"      Excluded QI Hours",{"$f":"(SUMIF(Table13151871013[Type of Care], \"QI\", Table13151871013[Duration]) - (IF(SUMIF(Table13151871013[Type of Care], \"QI\", Table13151871013[Duration])>= 4, 4,IF(SUMIF(Table13151871013[Type of Care], \"QI\", Table13151871013[Duration])<= 3, SUMIF(Table13151871013[Type of Care], \"QI\", Table13151871013[Duration]), 0))))","v":0},"EXQI1"]
[null,null,{"$f":"IF(B40=\"\", \"\", B40)","v":""},null,null,"Hours Above 90hr/semi-monthly",{"$f":"  (IF(SUMIFS(Table13151871013[Duration],Table13151871013[Date (YYYY-MM-DD)], \">\"&$D$10+14, Table13151871013[Type of Care], \"Direct/Indirect/Clinical Administration\")>= 90, (SUMIFS(Table13151871013[Duration],Table13151871013[Date (YYYY-MM-DD)], \">\"&$D$10+14, Table13151871013[Type of Care], \"Direct/Indirect/Clinical Administration\")+ (IF(SUMIF(Table13151871013[Type of Care], \"QI\", Table13151871013[Duration])>= 4, 4,IF(SUMIF(Table13151871013[Type of Care], \"QI\", Table13151871013[Duration])<= 3, SUMIF(Table13151871013[Type of Care], \"QI\", Table13151871013[Duration]), 0))) -90))) + (IF(SUMIFS(Table13151871013[Duration],Table13151871013[Date (YYYY-MM-DD)], \"<=\"&$D$10+14, Table13151871013[Type of Care], \"Direct/Indirect/Clinical Administration\")>= 90, (SUMIFS(Table13151871013[Duration],Table13151871013[Date (YYYY-MM-DD)], \"<=\"&$D$10+14, Table13151871013[Type of Care], \"Direct/Indirect/Clinical Administration\")+ (IF(SUMIF(Table13151871013[Type of Care], \"QI\", Table13151871013[Duration])>= 4, 4,IF(SUMIF(Table13151871013[Type of Care], \"QI\", Table13151871013[Duration])<= 3, SUMIF(Table13151871013[Type of Care], \"QI\", Table13151871013[Duration]), 0))) -90)))","v":0},"A901"]
[]
[]
[null,{"$f":"IF(Clinic!C5=\"Jan - Mar\", \"February\", IF(Clinic!C5= \"Apr - June\", \"May\", IF(Clinic!C5=\"July - Sept\", \"August\", IF(Clinic!C5=\" Oct - Dec\", \"November\"))))","v":"February"},{"$f":"Clinic!C6","v":2021},{"$f":"DATE(YEAR(B46),MONTH(DATEVALUE(B43&\"1\")),1)","v":"1900-02-01"},null,null,null,"Month2"]
[]
[null,"Date (YYYY-MM-DD)","Day ","Type of Care","Start Time AM/PM","End Time AM/PM","Duration","FALSE/TRUE"]
[null,null,{"$f":"IF(B46=\"\", \"\", B46)","v":""},null,null,null,null,{"$f":"IF( B46 > $D$43+14, SUMIFS($G$46:G46, $D$46:D46,\"Direct/Indirect/Clinical Administration\", $B$46:B46,\">\"&$D$43 + 14) + ((IF(SUMIF(Table132161981114[Type of Care], \"QI\", Table132161981114[Duration])>= 4, 4,IF(SUMIF(Table132161981114[Type of Care], \"QI\", Table132161981114[Duration])<= 3, SUMIF(Table132161981114[Type of Care], \"QI\", Table132161981114[Duration]), 0))))  > 90, SUMIFS($G$46:G46, $D$46:D46,\"Direct/Indirect/Clinical Administration\",  $B$46:B46,\"<=\"&$D$43 + 14)+ ((IF(SUMIF(Table132161981114[Type of Care], \"QI\", Table132161981114[Duration])>= 4, 4,IF(SUMIF(Table132161981114[Type of Care], \"QI\", Table132161981114[Duration])<= 3, SUMIF(Table132161981114[Type of Care], \"QI\", Table132161981114[Duration]), 0))))> 90)","v":false}]
[null,null,{"$f":"IF(B47=\"\", \"\", B47)","v":""},null,null,null,null,{"$f":"IF( B47 > $D$43+14, SUMIFS($G$46:G47, $D$46:D47,\"Direct/Indirect/Clinical Administration\", $B$46:B47,\">\"&$D$43 + 14) + ((IF(SUMIF(Table132161981114[Type of Care], \"QI\", Table132161981114[Duration])>= 4, 4,IF(SUMIF(Table132161981114[Type of Care], \"QI\", Table132161981114[Duration])<= 3, SUMIF(Table132161981114[Type of Care], \"QI\", Table132161981114[Duration]), 0))))  > 90, SUMIFS($G$46:G47, $D$46:D47,\"Direct/Indirect/Clinical Administration\",  $B$46:B47,\"<=\"&$D$43 + 14)+ ((IF(SUMIF(Table132161981114[Type of Care], \"QI\", Table132161981114[Duration])>= 4, 4,IF(SUMIF(Table132161981114[Type of Care], \"QI\", Table132161981114[Duration])<= 3, SUMIF(Table132161981114[Type of Care], \"QI\", Table132161981114[Duration]), 0))))> 90)","v":false}]
[null,null,"",null,null,null,null,{"$f":"IF( B48 > $D$43+14, SUMIFS($G$46:G48, $D$46:D48,\"Direct/Indirect/Clinical Administration\", $B$46:B48,\">\"&$D$43 + 14) + ((IF(SUMIF(Table132161981114[Type of Care], \"QI\", Table132161981114[Duration])>= 4, 4,IF(SUMIF(Table132161981114[Type of Care], \"QI\", Table132161981114[Duration])<= 3, SUMIF(Table132161981114[Type of Care], \"QI\", Table132161981114[Duration]), 0))))  > 90, SUMIFS($G$46:G48, $D$46:D48,\"Direct/Indirect/Clinical Administration\",  $B$46:B48,\"<=\"&$D$43 + 14)+ ((IF(SUMIF(Table132161981114[Type of Care], \"QI\", Table132161981114[Duration])>= 4, 4,IF(SUMIF(Table132161981114[Type of Care], \"QI\", Table132161981114[Duration])<= 3, SUMIF(Table132161981114[Type of Care], \"QI\", Table132161981114[Duration]), 0))))> 90)","v":false}]
[null,null,"",null,null,null,null,{"$f":"IF( B49 > $D$43+14, SUMIFS($G$46:G49, $D$46:D49,\"Direct/Indirect/Clinical Administration\", $B$46:B49,\">\"&$D$43 + 14) + ((IF(SUMIF(Table132161981114[Type of Care], \"QI\", Table132161981114[Duration])>= 4, 4,IF(SUMIF(Table132161981114[Type of Care], \"QI\", Table132161981114[Duration])<= 3, SUMIF(Table132161981114[Type of Care], \"QI\", Table132161981114[Duration]), 0))))  > 90, SUMIFS($G$46:G49, $D$46:D49,\"Direct/Indirect/Clinical Administration\",  $B$46:B49,\"<=\"&$D$43 + 14)+ ((IF(SUMIF(Table132161981114[Type of Care], \"QI\", Table132161981114[Duration])>= 4, 4,IF(SUMIF(Table132161981114[Type of Care], \"QI\", Table132161981114[Duration])<= 3, SUMIF(Table132161981114[Type of Care], \"QI\", Table132161981114[Duration]), 0))))> 90)","v":false}]
[null,null,"",null,null,null,null,{"$f":"IF( B50 > $D$43+14, SUMIFS($G$46:G50, $D$46:D50,\"Direct/Indirect/Clinical Administration\", $B$46:B50,\">\"&$D$43 + 14) + ((IF(SUMIF(Table132161981114[Type of Care], \"QI\", Table132161981114[Duration])>= 4, 4,IF(SUMIF(Table132161981114[Type of Care], \"QI\", Table132161981114[Duration])<= 3, SUMIF(Table132161981114[Type of Care], \"QI\", Table132161981114[Duration]), 0))))  > 90, SUMIFS($G$46:G50, $D$46:D50,\"Direct/Indirect/Clinical Administration\",  $B$46:B50,\"<=\"&$D$43 + 14)+ ((IF(SUMIF(Table132161981114[Type of Care], \"QI\", Table132161981114[Duration])>= 4, 4,IF(SUMIF(Table132161981114[Type of Care], \"QI\", Table132161981114[Duration])<= 3, SUMIF(Table132161981114[Type of Care], \"QI\", Table132161981114[Duration]), 0))))> 90)","v":false}]
[null,null,"",null,null,null,null,{"$f":"IF( B51 > $D$43+14, SUMIFS($G$46:G51, $D$46:D51,\"Direct/Indirect/Clinical Administration\", $B$46:B51,\">\"&$D$43 + 14) + ((IF(SUMIF(Table132161981114[Type of Care], \"QI\", Table132161981114[Duration])>= 4, 4,IF(SUMIF(Table132161981114[Type of Care], \"QI\", Table132161981114[Duration])<= 3, SUMIF(Table132161981114[Type of Care], \"QI\", Table132161981114[Duration]), 0))))  > 90, SUMIFS($G$46:G51, $D$46:D51,\"Direct/Indirect/Clinical Administration\",  $B$46:B51,\"<=\"&$D$43 + 14)+ ((IF(SUMIF(Table132161981114[Type of Care], \"QI\", Table132161981114[Duration])>= 4, 4,IF(SUMIF(Table132161981114[Type of Care], \"QI\", Table132161981114[Duration])<= 3, SUMIF(Table132161981114[Type of Care], \"QI\", Table132161981114[Duration]), 0))))> 90)","v":false}]
[null,null,"",null,null,null,null,{"$f":"IF( B52 > $D$43+14, SUMIFS($G$46:G52, $D$46:D52,\"Direct/Indirect/Clinical Administration\", $B$46:B52,\">\"&$D$43 + 14) + ((IF(SUMIF(Table132161981114[Type of Care], \"QI\", Table132161981114[Duration])>= 4, 4,IF(SUMIF(Table132161981114[Type of Care], \"QI\", Table132161981114[Duration])<= 3, SUMIF(Table132161981114[Type of Care], \"QI\", Table132161981114[Duration]), 0))))  > 90, SUMIFS($G$46:G52, $D$46:D52,\"Direct/Indirect/Clinical Administration\",  $B$46:B52,\"<=\"&$D$43 + 14)+ ((IF(SUMIF(Table132161981114[Type of Care], \"QI\", Table132161981114[Duration])>= 4, 4,IF(SUMIF(Table132161981114[Type of Care], \"QI\", Table132161981114[Duration])<= 3, SUMIF(Table132161981114[Type of Care], \"QI\", Table132161981114[Duration]), 0))))> 90)","v":false}]
[null,null,"",null,null,null,null,{"$f":"IF( B53 > $D$43+14, SUMIFS($G$46:G53, $D$46:D53,\"Direct/Indirect/Clinical Administration\", $B$46:B53,\">\"&$D$43 + 14) + ((IF(SUMIF(Table132161981114[Type of Care], \"QI\", Table132161981114[Duration])>= 4, 4,IF(SUMIF(Table132161981114[Type of Care], \"QI\", Table132161981114[Duration])<= 3, SUMIF(Table132161981114[Type of Care], \"QI\", Table132161981114[Duration]), 0))))  > 90, SUMIFS($G$46:G53, $D$46:D53,\"Direct/Indirect/Clinical Administration\",  $B$46:B53,\"<=\"&$D$43 + 14)+ ((IF(SUMIF(Table132161981114[Type of Care], \"QI\", Table132161981114[Duration])>= 4, 4,IF(SUMIF(Table132161981114[Type of Care], \"QI\", Table132161981114[Duration])<= 3, SUMIF(Table132161981114[Type of Care], \"QI\", Table132161981114[Duration]), 0))))> 90)","v":false}]
[null,null,"",null,null,null,null,{"$f":"IF( B54 > $D$43+14, SUMIFS($G$46:G54, $D$46:D54,\"Direct/Indirect/Clinical Administration\", $B$46:B54,\">\"&$D$43 + 14) + ((IF(SUMIF(Table132161981114[Type of Care], \"QI\", Table132161981114[Duration])>= 4, 4,IF(SUMIF(Table132161981114[Type of Care], \"QI\", Table132161981114[Duration])<= 3, SUMIF(Table132161981114[Type of Care], \"QI\", Table132161981114[Duration]), 0))))  > 90, SUMIFS($G$46:G54, $D$46:D54,\"Direct/Indirect/Clinical Administration\",  $B$46:B54,\"<=\"&$D$43 + 14)+ ((IF(SUMIF(Table132161981114[Type of Care], \"QI\", Table132161981114[Duration])>= 4, 4,IF(SUMIF(Table132161981114[Type of Care], \"QI\", Table132161981114[Duration])<= 3, SUMIF(Table132161981114[Type of Care], \"QI\", Table132161981114[Duration]), 0))))> 90)","v":false}]
[null,null,"",null,null,null,null,{"$f":"IF( B55 > $D$43+14, SUMIFS($G$46:G55, $D$46:D55,\"Direct/Indirect/Clinical Administration\", $B$46:B55,\">\"&$D$43 + 14) + ((IF(SUMIF(Table132161981114[Type of Care], \"QI\", Table132161981114[Duration])>= 4, 4,IF(SUMIF(Table132161981114[Type of Care], \"QI\", Table132161981114[Duration])<= 3, SUMIF(Table132161981114[Type of Care], \"QI\", Table132161981114[Duration]), 0))))  > 90, SUMIFS($G$46:G55, $D$46:D55,\"Direct/Indirect/Clinical Administration\",  $B$46:B55,\"<=\"&$D$43 + 14)+ ((IF(SUMIF(Table132161981114[Type of Care], \"QI\", Table132161981114[Duration])>= 4, 4,IF(SUMIF(Table132161981114[Type of Care], \"QI\", Table132161981114[Duration])<= 3, SUMIF(Table132161981114[Type of Care], \"QI\", Table132161981114[Duration]), 0))))> 90)","v":false}]
[null,null,"",null,null,null,null,{"$f":"IF( B56 > $D$43+14, SUMIFS($G$46:G56, $D$46:D56,\"Direct/Indirect/Clinical Administration\", $B$46:B56,\">\"&$D$43 + 14) + ((IF(SUMIF(Table132161981114[Type of Care], \"QI\", Table132161981114[Duration])>= 4, 4,IF(SUMIF(Table132161981114[Type of Care], \"QI\", Table132161981114[Duration])<= 3, SUMIF(Table132161981114[Type of Care], \"QI\", Table132161981114[Duration]), 0))))  > 90, SUMIFS($G$46:G56, $D$46:D56,\"Direct/Indirect/Clinical Administration\",  $B$46:B56,\"<=\"&$D$43 + 14)+ ((IF(SUMIF(Table132161981114[Type of Care], \"QI\", Table132161981114[Duration])>= 4, 4,IF(SUMIF(Table132161981114[Type of Care], \"QI\", Table132161981114[Duration])<= 3, SUMIF(Table132161981114[Type of Care], \"QI\", Table132161981114[Duration]), 0))))> 90)","v":false}]
[null,null,"",null,null,null,null,{"$f":"IF( B57 > $D$43+14, SUMIFS($G$46:G57, $D$46:D57,\"Direct/Indirect/Clinical Administration\", $B$46:B57,\">\"&$D$43 + 14) + ((IF(SUMIF(Table132161981114[Type of Care], \"QI\", Table132161981114[Duration])>= 4, 4,IF(SUMIF(Table132161981114[Type of Care], \"QI\", Table132161981114[Duration])<= 3, SUMIF(Table132161981114[Type of Care], \"QI\", Table132161981114[Duration]), 0))))  > 90, SUMIFS($G$46:G57, $D$46:D57,\"Direct/Indirect/Clinical Administration\",  $B$46:B57,\"<=\"&$D$43 + 14)+ ((IF(SUMIF(Table132161981114[Type of Care], \"QI\", Table132161981114[Duration])>= 4, 4,IF(SUMIF(Table132161981114[Type of Care], \"QI\", Table132161981114[Duration])<= 3, SUMIF(Table132161981114[Type of Care], \"QI\", Table132161981114[Duration]), 0))))> 90)","v":false}]
[null,null,"",null,null,null,null,{"$f":"IF( B58 > $D$43+14, SUMIFS($G$46:G58, $D$46:D58,\"Direct/Indirect/Clinical Administration\", $B$46:B58,\">\"&$D$43 + 14) + ((IF(SUMIF(Table132161981114[Type of Care], \"QI\", Table132161981114[Duration])>= 4, 4,IF(SUMIF(Table132161981114[Type of Care], \"QI\", Table132161981114[Duration])<= 3, SUMIF(Table132161981114[Type of Care], \"QI\", Table132161981114[Duration]), 0))))  > 90, SUMIFS($G$46:G58, $D$46:D58,\"Direct/Indirect/Clinical Administration\",  $B$46:B58,\"<=\"&$D$43 + 14)+ ((IF(SUMIF(Table132161981114[Type of Care], \"QI\", Table132161981114[Duration])>= 4, 4,IF(SUMIF(Table132161981114[Type of Care], \"QI\", Table132161981114[Duration])<= 3, SUMIF(Table132161981114[Type of Care], \"QI\", Table132161981114[Duration]), 0))))> 90)","v":false}]
[null,null,"",null,null,null,null,{"$f":"IF( B59 > $D$43+14, SUMIFS($G$46:G59, $D$46:D59,\"Direct/Indirect/Clinical Administration\", $B$46:B59,\">\"&$D$43 + 14) + ((IF(SUMIF(Table132161981114[Type of Care], \"QI\", Table132161981114[Duration])>= 4, 4,IF(SUMIF(Table132161981114[Type of Care], \"QI\", Table132161981114[Duration])<= 3, SUMIF(Table132161981114[Type of Care], \"QI\", Table132161981114[Duration]), 0))))  > 90, SUMIFS($G$46:G59, $D$46:D59,\"Direct/Indirect/Clinical Administration\",  $B$46:B59,\"<=\"&$D$43 + 14)+ ((IF(SUMIF(Table132161981114[Type of Care], \"QI\", Table132161981114[Duration])>= 4, 4,IF(SUMIF(Table132161981114[Type of Care], \"QI\", Table132161981114[Duration])<= 3, SUMIF(Table132161981114[Type of Care], \"QI\", Table132161981114[Duration]), 0))))> 90)","v":false}]
[null,null,"",null,null,null,null,{"$f":"IF( B60 > $D$43+14, SUMIFS($G$46:G60, $D$46:D60,\"Direct/Indirect/Clinical Administration\", $B$46:B60,\">\"&$D$43 + 14) + ((IF(SUMIF(Table132161981114[Type of Care], \"QI\", Table132161981114[Duration])>= 4, 4,IF(SUMIF(Table132161981114[Type of Care], \"QI\", Table132161981114[Duration])<= 3, SUMIF(Table132161981114[Type of Care], \"QI\", Table132161981114[Duration]), 0))))  > 90, SUMIFS($G$46:G60, $D$46:D60,\"Direct/Indirect/Clinical Administration\",  $B$46:B60,\"<=\"&$D$43 + 14)+ ((IF(SUMIF(Table132161981114[Type of Care], \"QI\", Table132161981114[Duration])>= 4, 4,IF(SUMIF(Table132161981114[Type of Care], \"QI\", Table132161981114[Duration])<= 3, SUMIF(Table132161981114[Type of Care], \"QI\", Table132161981114[Duration]), 0))))> 90)","v":false}]
[null,null,"",null,null,null,null,{"$f":"IF( B61 > $D$43+14, SUMIFS($G$46:G61, $D$46:D61,\"Direct/Indirect/Clinical Administration\", $B$46:B61,\">\"&$D$43 + 14) + ((IF(SUMIF(Table132161981114[Type of Care], \"QI\", Table132161981114[Duration])>= 4, 4,IF(SUMIF(Table132161981114[Type of Care], \"QI\", Table132161981114[Duration])<= 3, SUMIF(Table132161981114[Type of Care], \"QI\", Table132161981114[Duration]), 0))))  > 90, SUMIFS($G$46:G61, $D$46:D61,\"Direct/Indirect/Clinical Administration\",  $B$46:B61,\"<=\"&$D$43 + 14)+ ((IF(SUMIF(Table132161981114[Type of Care], \"QI\", Table132161981114[Duration])>= 4, 4,IF(SUMIF(Table132161981114[Type of Care], \"QI\", Table132161981114[Duration])<= 3, SUMIF(Table132161981114[Type of Care], \"QI\", Table132161981114[Duration]), 0))))> 90)","v":false}]
[null,null,"",null,null,null,null,{"$f":"IF( B62 > $D$43+14, SUMIFS($G$46:G62, $D$46:D62,\"Direct/Indirect/Clinical Administration\", $B$46:B62,\">\"&$D$43 + 14) + ((IF(SUMIF(Table132161981114[Type of Care], \"QI\", Table132161981114[Duration])>= 4, 4,IF(SUMIF(Table132161981114[Type of Care], \"QI\", Table132161981114[Duration])<= 3, SUMIF(Table132161981114[Type of Care], \"QI\", Table132161981114[Duration]), 0))))  > 90, SUMIFS($G$46:G62, $D$46:D62,\"Direct/Indirect/Clinical Administration\",  $B$46:B62,\"<=\"&$D$43 + 14)+ ((IF(SUMIF(Table132161981114[Type of Care], \"QI\", Table132161981114[Duration])>= 4, 4,IF(SUMIF(Table132161981114[Type of Care], \"QI\", Table132161981114[Duration])<= 3, SUMIF(Table132161981114[Type of Care], \"QI\", Table132161981114[Duration]), 0))))> 90)","v":false}]
[null,null,"",null,null,null,null,{"$f":"IF( B63 > $D$43+14, SUMIFS($G$46:G63, $D$46:D63,\"Direct/Indirect/Clinical Administration\", $B$46:B63,\">\"&$D$43 + 14) + ((IF(SUMIF(Table132161981114[Type of Care], \"QI\", Table132161981114[Duration])>= 4, 4,IF(SUMIF(Table132161981114[Type of Care], \"QI\", Table132161981114[Duration])<= 3, SUMIF(Table132161981114[Type of Care], \"QI\", Table132161981114[Duration]), 0))))  > 90, SUMIFS($G$46:G63, $D$46:D63,\"Direct/Indirect/Clinical Administration\",  $B$46:B63,\"<=\"&$D$43 + 14)+ ((IF(SUMIF(Table132161981114[Type of Care], \"QI\", Table132161981114[Duration])>= 4, 4,IF(SUMIF(Table132161981114[Type of Care], \"QI\", Table132161981114[Duration])<= 3, SUMIF(Table132161981114[Type of Care], \"QI\", Table132161981114[Duration]), 0))))> 90)","v":false}]
[null,null,"",null,null,null,null,{"$f":"IF( B64 > $D$43+14, SUMIFS($G$46:G64, $D$46:D64,\"Direct/Indirect/Clinical Administration\", $B$46:B64,\">\"&$D$43 + 14) + ((IF(SUMIF(Table132161981114[Type of Care], \"QI\", Table132161981114[Duration])>= 4, 4,IF(SUMIF(Table132161981114[Type of Care], \"QI\", Table132161981114[Duration])<= 3, SUMIF(Table132161981114[Type of Care], \"QI\", Table132161981114[Duration]), 0))))  > 90, SUMIFS($G$46:G64, $D$46:D64,\"Direct/Indirect/Clinical Administration\",  $B$46:B64,\"<=\"&$D$43 + 14)+ ((IF(SUMIF(Table132161981114[Type of Care], \"QI\", Table132161981114[Duration])>= 4, 4,IF(SUMIF(Table132161981114[Type of Care], \"QI\", Table132161981114[Duration])<= 3, SUMIF(Table132161981114[Type of Care], \"QI\", Table132161981114[Duration]), 0))))> 90)","v":false}]
[null,null,"",null,null,null,null,{"$f":"IF( B65 > $D$43+14, SUMIFS($G$46:G65, $D$46:D65,\"Direct/Indirect/Clinical Administration\", $B$46:B65,\">\"&$D$43 + 14) + ((IF(SUMIF(Table132161981114[Type of Care], \"QI\", Table132161981114[Duration])>= 4, 4,IF(SUMIF(Table132161981114[Type of Care], \"QI\", Table132161981114[Duration])<= 3, SUMIF(Table132161981114[Type of Care], \"QI\", Table132161981114[Duration]), 0))))  > 90, SUMIFS($G$46:G65, $D$46:D65,\"Direct/Indirect/Clinical Administration\",  $B$46:B65,\"<=\"&$D$43 + 14)+ ((IF(SUMIF(Table132161981114[Type of Care], \"QI\", Table132161981114[Duration])>= 4, 4,IF(SUMIF(Table132161981114[Type of Care], \"QI\", Table132161981114[Duration])<= 3, SUMIF(Table132161981114[Type of Care], \"QI\", Table132161981114[Duration]), 0))))> 90)","v":false}]
[null,null,"",null,null,null,null,{"$f":"IF( B66 > $D$43+14, SUMIFS($G$46:G66, $D$46:D66,\"Direct/Indirect/Clinical Administration\", $B$46:B66,\">\"&$D$43 + 14) + ((IF(SUMIF(Table132161981114[Type of Care], \"QI\", Table132161981114[Duration])>= 4, 4,IF(SUMIF(Table132161981114[Type of Care], \"QI\", Table132161981114[Duration])<= 3, SUMIF(Table132161981114[Type of Care], \"QI\", Table132161981114[Duration]), 0))))  > 90, SUMIFS($G$46:G66, $D$46:D66,\"Direct/Indirect/Clinical Administration\",  $B$46:B66,\"<=\"&$D$43 + 14)+ ((IF(SUMIF(Table132161981114[Type of Care], \"QI\", Table132161981114[Duration])>= 4, 4,IF(SUMIF(Table132161981114[Type of Care], \"QI\", Table132161981114[Duration])<= 3, SUMIF(Table132161981114[Type of Care], \"QI\", Table132161981114[Duration]), 0))))> 90)","v":false}]
[null,null,"",null,null,null,null,{"$f":"IF( B67 > $D$43+14, SUMIFS($G$46:G67, $D$46:D67,\"Direct/Indirect/Clinical Administration\", $B$46:B67,\">\"&$D$43 + 14) + ((IF(SUMIF(Table132161981114[Type of Care], \"QI\", Table132161981114[Duration])>= 4, 4,IF(SUMIF(Table132161981114[Type of Care], \"QI\", Table132161981114[Duration])<= 3, SUMIF(Table132161981114[Type of Care], \"QI\", Table132161981114[Duration]), 0))))  > 90, SUMIFS($G$46:G67, $D$46:D67,\"Direct/Indirect/Clinical Administration\",  $B$46:B67,\"<=\"&$D$43 + 14)+ ((IF(SUMIF(Table132161981114[Type of Care], \"QI\", Table132161981114[Duration])>= 4, 4,IF(SUMIF(Table132161981114[Type of Care], \"QI\", Table132161981114[Duration])<= 3, SUMIF(Table132161981114[Type of Care], \"QI\", Table132161981114[Duration]), 0))))> 90)","v":false}]
[null,null,"",null,null,null,null,{"$f":"IF( B68 > $D$43+14, SUMIFS($G$46:G68, $D$46:D68,\"Direct/Indirect/Clinical Administration\", $B$46:B68,\">\"&$D$43 + 14) + ((IF(SUMIF(Table132161981114[Type of Care], \"QI\", Table132161981114[Duration])>= 4, 4,IF(SUMIF(Table132161981114[Type of Care], \"QI\", Table132161981114[Duration])<= 3, SUMIF(Table132161981114[Type of Care], \"QI\", Table132161981114[Duration]), 0))))  > 90, SUMIFS($G$46:G68, $D$46:D68,\"Direct/Indirect/Clinical Administration\",  $B$46:B68,\"<=\"&$D$43 + 14)+ ((IF(SUMIF(Table132161981114[Type of Care], \"QI\", Table132161981114[Duration])>= 4, 4,IF(SUMIF(Table132161981114[Type of Care], \"QI\", Table132161981114[Duration])<= 3, SUMIF(Table132161981114[Type of Care], \"QI\", Table132161981114[Duration]), 0))))> 90)","v":false}]
[null,null,"",null,null,null,null,{"$f":"IF( B69 > $D$43+14, SUMIFS($G$46:G69, $D$46:D69,\"Direct/Indirect/Clinical Administration\", $B$46:B69,\">\"&$D$43 + 14) + ((IF(SUMIF(Table132161981114[Type of Care], \"QI\", Table132161981114[Duration])>= 4, 4,IF(SUMIF(Table132161981114[Type of Care], \"QI\", Table132161981114[Duration])<= 3, SUMIF(Table132161981114[Type of Care], \"QI\", Table132161981114[Duration]), 0))))  > 90, SUMIFS($G$46:G69, $D$46:D69,\"Direct/Indirect/Clinical Administration\",  $B$46:B69,\"<=\"&$D$43 + 14)+ ((IF(SUMIF(Table132161981114[Type of Care], \"QI\", Table132161981114[Duration])>= 4, 4,IF(SUMIF(Table132161981114[Type of Care], \"QI\", Table132161981114[Duration])<= 3, SUMIF(Table132161981114[Type of Care], \"QI\", Table132161981114[Duration]), 0))))> 90)","v":false}]
[null,null,"",null,null,null,null,{"$f":"IF( B70 > $D$43+14, SUMIFS($G$46:G70, $D$46:D70,\"Direct/Indirect/Clinical Administration\", $B$46:B70,\">\"&$D$43 + 14) + ((IF(SUMIF(Table132161981114[Type of Care], \"QI\", Table132161981114[Duration])>= 4, 4,IF(SUMIF(Table132161981114[Type of Care], \"QI\", Table132161981114[Duration])<= 3, SUMIF(Table132161981114[Type of Care], \"QI\", Table132161981114[Duration]), 0))))  > 90, SUMIFS($G$46:G70, $D$46:D70,\"Direct/Indirect/Clinical Administration\",  $B$46:B70,\"<=\"&$D$43 + 14)+ ((IF(SUMIF(Table132161981114[Type of Care], \"QI\", Table132161981114[Duration])>= 4, 4,IF(SUMIF(Table132161981114[Type of Care], \"QI\", Table132161981114[Duration])<= 3, SUMIF(Table132161981114[Type of Care], \"QI\", Table132161981114[Duration]), 0))))> 90)","v":false}]
[null,null,"",null,null,null,null,{"$f":"IF( B71 > $D$43+14, SUMIFS($G$46:G71, $D$46:D71,\"Direct/Indirect/Clinical Administration\", $B$46:B71,\">\"&$D$43 + 14) + ((IF(SUMIF(Table132161981114[Type of Care], \"QI\", Table132161981114[Duration])>= 4, 4,IF(SUMIF(Table132161981114[Type of Care], \"QI\", Table132161981114[Duration])<= 3, SUMIF(Table132161981114[Type of Care], \"QI\", Table132161981114[Duration]), 0))))  > 90, SUMIFS($G$46:G71, $D$46:D71,\"Direct/Indirect/Clinical Administration\",  $B$46:B71,\"<=\"&$D$43 + 14)+ ((IF(SUMIF(Table132161981114[Type of Care], \"QI\", Table132161981114[Duration])>= 4, 4,IF(SUMIF(Table132161981114[Type of Care], \"QI\", Table132161981114[Duration])<= 3, SUMIF(Table132161981114[Type of Care], \"QI\", Table132161981114[Duration]), 0))))> 90)","v":false}]
[null,null,{"$f":"IF(B72=\"\", \"\", B72)","v":""},null,null,null,null,{"$f":"IF( B72 > $D$43+14, SUMIFS($G$46:G72, $D$46:D72,\"Direct/Indirect/Clinical Administration\", $B$46:B72,\">\"&$D$43 + 14) + ((IF(SUMIF(Table132161981114[Type of Care], \"QI\", Table132161981114[Duration])>= 4, 4,IF(SUMIF(Table132161981114[Type of Care], \"QI\", Table132161981114[Duration])<= 3, SUMIF(Table132161981114[Type of Care], \"QI\", Table132161981114[Duration]), 0))))  > 90, SUMIFS($G$46:G72, $D$46:D72,\"Direct/Indirect/Clinical Administration\",  $B$46:B72,\"<=\"&$D$43 + 14)+ ((IF(SUMIF(Table132161981114[Type of Care], \"QI\", Table132161981114[Duration])>= 4, 4,IF(SUMIF(Table132161981114[Type of Care], \"QI\", Table132161981114[Duration])<= 3, SUMIF(Table132161981114[Type of Care], \"QI\", Table132161981114[Duration]), 0))))> 90)","v":false}]
[null,null,"",null,null,null,null,{"$f":"IF( B73 > $D$43+14, SUMIFS($G$46:G73, $D$46:D73,\"Direct/Indirect/Clinical Administration\", $B$46:B73,\">\"&$D$43 + 14) + ((IF(SUMIF(Table132161981114[Type of Care], \"QI\", Table132161981114[Duration])>= 4, 4,IF(SUMIF(Table132161981114[Type of Care], \"QI\", Table132161981114[Duration])<= 3, SUMIF(Table132161981114[Type of Care], \"QI\", Table132161981114[Duration]), 0))))  > 90, SUMIFS($G$46:G73, $D$46:D73,\"Direct/Indirect/Clinical Administration\",  $B$46:B73,\"<=\"&$D$43 + 14)+ ((IF(SUMIF(Table132161981114[Type of Care], \"QI\", Table132161981114[Duration])>= 4, 4,IF(SUMIF(Table132161981114[Type of Care], \"QI\", Table132161981114[Duration])<= 3, SUMIF(Table132161981114[Type of Care], \"QI\", Table132161981114[Duration]), 0))))> 90)","v":false}]
[null,null,"",null,null,null,null,{"$f":"IF( B74 > $D$43+14, SUMIFS($G$46:G74, $D$46:D74,\"Direct/Indirect/Clinical Administration\", $B$46:B74,\">\"&$D$43 + 14) + ((IF(SUMIF(Table132161981114[Type of Care], \"QI\", Table132161981114[Duration])>= 4, 4,IF(SUMIF(Table132161981114[Type of Care], \"QI\", Table132161981114[Duration])<= 3, SUMIF(Table132161981114[Type of Care], \"QI\", Table132161981114[Duration]), 0))))  > 90, SUMIFS($G$46:G74, $D$46:D74,\"Direct/Indirect/Clinical Administration\",  $B$46:B74,\"<=\"&$D$43 + 14)+ ((IF(SUMIF(Table132161981114[Type of Care], \"QI\", Table132161981114[Duration])>= 4, 4,IF(SUMIF(Table132161981114[Type of Care], \"QI\", Table132161981114[Duration])<= 3, SUMIF(Table132161981114[Type of Care], \"QI\", Table132161981114[Duration]), 0))))> 90)","v":false}]
[null,null,{"$f":"IF(B75=\"\", \"\", B75)","v":""},null,null,"Total Contract Hours",{"$f":"(SUMIF(Table132161981114[Type of Care], \"Direct/Indirect/Clinical Administration\",Table132161981114[Duration])) + (SUMIF(Table132161981114[Type of Care], \"Correction Hours\",Table132161981114[Duration]))","v":0},"CT2"]
[null,null,null,null,null,"Total Included QI Hours",{"$f":"(IF(SUMIF(Table132161981114[Type of Care], \"QI\", Table132161981114[Duration])>= 4, 4,IF(SUMIF(Table132161981114[Type of Care], \"QI\", Table132161981114[Duration])<= 3, SUMIF(Table132161981114[Type of Care], \"QI\", Table132161981114[Duration]), 0)))","v":0},"QI2"]
[null,null,null,null,null,"Total Excluded Hours",{"$f":"G78+G79","v":0},"EX2"]
[null,null,null,null,null,"         Excluded Contract Hours",{"$f":"(SUMIF(Table132161981114[Type of Care], \"Third Party/Specialist FFS\",Table132161981114[Duration])) + (SUMIF(Table132161981114[Type of Care], \"Break (>15 Minutes)\", Table132161981114[Duration]))","v":0},"EXC2"]
[null,null,null,null,null,"      Excluded QI Hours",{"$f":"(SUMIF(Table132161981114[Type of Care], \"QI\", Table132161981114[Duration]) - (IF(SUMIF(Table132161981114[Type of Care], \"QI\", Table132161981114[Duration])>= 4, 4,IF(SUMIF(Table132161981114[Type of Care], \"QI\", Table132161981114[Duration])<= 3, SUMIF(Table132161981114[Type of Care], \"QI\", Table132161981114[Duration]), 0))))","v":0},"EXQI2"]
[null,null,{"$f":"IF(B80=\"\", \"\", B80)","v":""},null,null,"Hours Above 90hr/semi-monthly",{"$f":"  (IF(SUMIFS(Table132161981114[Duration],Table132161981114[Date (YYYY-MM-DD)], \">\"&$D$43+14, Table132161981114[Type of Care], \"Direct/Indirect/Clinical Administration\")>= 90, (SUMIFS(Table132161981114[Duration],Table132161981114[Date (YYYY-MM-DD)], \">\"&$D$43+14, Table132161981114[Type of Care], \"Direct/Indirect/Clinical Administration\")+ (IF(SUMIF(Table132161981114[Type of Care], \"QI\", Table132161981114[Duration])>= 4, 4,IF(SUMIF(Table132161981114[Type of Care], \"QI\", Table132161981114[Duration])<= 3, SUMIF(Table132161981114[Type of Care], \"QI\", Table132161981114[Duration]), 0))) -90))) + (IF(SUMIFS(Table132161981114[Duration],Table132161981114[Date (YYYY-MM-DD)], \"<=\"&$D$43+14, Table132161981114[Type of Care], \"Direct/Indirect/Clinical Administration\")>= 90, (SUMIFS(Table132161981114[Duration],Table132161981114[Date (YYYY-MM-DD)], \"<=\"&$D$43+14, Table132161981114[Type of Care], \"Direct/Indirect/Clinical Administration\")+ (IF(SUMIF(Table132161981114[Type of Care], \"QI\", Table132161981114[Duration])>= 4, 4,IF(SUMIF(Table132161981114[Type of Care], \"QI\", Table132161981114[Duration])<= 3, SUMIF(Table132161981114[Type of Care], \"QI\", Table132161981114[Duration]), 0))) -90)))","v":0},"A902"]
[]
[]
[null,{"$f":"IF(Clinic!C5=\"Jan - Mar\", \"March\", IF(Clinic!C5= \"Apr - June\", \"June\", IF(Clinic!C5=\"July - Sept\", \"September\", IF(Clinic!C5=\" Oct - Dec\", \"December\"))))","v":"March"},{"$f":"Clinic!C6","v":2021},{"$f":"DATE(YEAR(B86),MONTH(DATEVALUE(B83&\"1\")),1)","v":"1900-03-01"},null,null,null,"Month3"]
[]
[null,"Date (YYYY-MM-DD)","Day ","Type of Care","Start Time AM/PM","End Time AM/PM","Duration ","FALSE/TRUE"]
[null,null,{"$f":"IF(B86=\"\", \"\", B86)","v":""},null,null,null,null,{"$f":"IF( B86 > $D$83+14, SUMIFS($G$86:G86, $D$86:D86,\"Direct/Indirect/Clinical Administration\", $B$86:B86,\">\"&$D$83 + 14) + ((IF(SUMIF(Table1326172091221[Type of Care], \"QI\", Table1326172091221[[Duration ]])>= 4, 4,IF(SUMIF(Table1326172091221[Type of Care], \"QI\", Table1326172091221[[Duration ]])<= 3, SUMIF(Table1326172091221[Type of Care], \"QI\", Table1326172091221[[Duration ]]), 0))))  > 90, SUMIFS($G$86:G86, $D$86:D86,\"Direct/Indirect/Clinical Administration\",  $B$86:B86,\"<=\"&$D$83 + 14)+ ((IF(SUMIF(Table1326172091221[Type of Care], \"QI\", Table1326172091221[[Duration ]])>= 4, 4,IF(SUMIF(Table1326172091221[Type of Care], \"QI\", Table1326172091221[[Duration ]])<= 3, SUMIF(Table1326172091221[Type of Care], \"QI\", Table1326172091221[[Duration ]]), 0))))> 90)","v":false}]
[null,null,{"$f":"IF(B87=\"\", \"\", B87)","v":""},null,null,null,null,{"$f":"IF( B87 > $D$83+14, SUMIFS($G$86:G87, $D$86:D87,\"Direct/Indirect/Clinical Administration\", $B$86:B87,\">\"&$D$83 + 14) + ((IF(SUMIF(Table1326172091221[Type of Care], \"QI\", Table1326172091221[[Duration ]])>= 4, 4,IF(SUMIF(Table1326172091221[Type of Care], \"QI\", Table1326172091221[[Duration ]])<= 3, SUMIF(Table1326172091221[Type of Care], \"QI\", Table1326172091221[[Duration ]]), 0))))  > 90, SUMIFS($G$86:G87, $D$86:D87,\"Direct/Indirect/Clinical Administration\",  $B$86:B87,\"<=\"&$D$83 + 14)+ ((IF(SUMIF(Table1326172091221[Type of Care], \"QI\", Table1326172091221[[Duration ]])>= 4, 4,IF(SUMIF(Table1326172091221[Type of Care], \"QI\", Table1326172091221[[Duration ]])<= 3, SUMIF(Table1326172091221[Type of Care], \"QI\", Table1326172091221[[Duration ]]), 0))))> 90)","v":false}]
[null,null,"",null,null,null,null,{"$f":"IF( B88 > $D$83+14, SUMIFS($G$86:G88, $D$86:D88,\"Direct/Indirect/Clinical Administration\", $B$86:B88,\">\"&$D$83 + 14) + ((IF(SUMIF(Table1326172091221[Type of Care], \"QI\", Table1326172091221[[Duration ]])>= 4, 4,IF(SUMIF(Table1326172091221[Type of Care], \"QI\", Table1326172091221[[Duration ]])<= 3, SUMIF(Table1326172091221[Type of Care], \"QI\", Table1326172091221[[Duration ]]), 0))))  > 90, SUMIFS($G$86:G88, $D$86:D88,\"Direct/Indirect/Clinical Administration\",  $B$86:B88,\"<=\"&$D$83 + 14)+ ((IF(SUMIF(Table1326172091221[Type of Care], \"QI\", Table1326172091221[[Duration ]])>= 4, 4,IF(SUMIF(Table1326172091221[Type of Care], \"QI\", Table1326172091221[[Duration ]])<= 3, SUMIF(Table1326172091221[Type of Care], \"QI\", Table1326172091221[[Duration ]]), 0))))> 90)","v":false}]
[null,null,"",null,null,null,null,{"$f":"IF( B89 > $D$83+14, SUMIFS($G$86:G89, $D$86:D89,\"Direct/Indirect/Clinical Administration\", $B$86:B89,\">\"&$D$83 + 14) + ((IF(SUMIF(Table1326172091221[Type of Care], \"QI\", Table1326172091221[[Duration ]])>= 4, 4,IF(SUMIF(Table1326172091221[Type of Care], \"QI\", Table1326172091221[[Duration ]])<= 3, SUMIF(Table1326172091221[Type of Care], \"QI\", Table1326172091221[[Duration ]]), 0))))  > 90, SUMIFS($G$86:G89, $D$86:D89,\"Direct/Indirect/Clinical Administration\",  $B$86:B89,\"<=\"&$D$83 + 14)+ ((IF(SUMIF(Table1326172091221[Type of Care], \"QI\", Table1326172091221[[Duration ]])>= 4, 4,IF(SUMIF(Table1326172091221[Type of Care], \"QI\", Table1326172091221[[Duration ]])<= 3, SUMIF(Table1326172091221[Type of Care], \"QI\", Table1326172091221[[Duration ]]), 0))))> 90)","v":false}]
[null,null,"",null,null,null,null,{"$f":"IF( B90 > $D$83+14, SUMIFS($G$86:G90, $D$86:D90,\"Direct/Indirect/Clinical Administration\", $B$86:B90,\">\"&$D$83 + 14) + ((IF(SUMIF(Table1326172091221[Type of Care], \"QI\", Table1326172091221[[Duration ]])>= 4, 4,IF(SUMIF(Table1326172091221[Type of Care], \"QI\", Table1326172091221[[Duration ]])<= 3, SUMIF(Table1326172091221[Type of Care], \"QI\", Table1326172091221[[Duration ]]), 0))))  > 90, SUMIFS($G$86:G90, $D$86:D90,\"Direct/Indirect/Clinical Administration\",  $B$86:B90,\"<=\"&$D$83 + 14)+ ((IF(SUMIF(Table1326172091221[Type of Care], \"QI\", Table1326172091221[[Duration ]])>= 4, 4,IF(SUMIF(Table1326172091221[Type of Care], \"QI\", Table1326172091221[[Duration ]])<= 3, SUMIF(Table1326172091221[Type of Care], \"QI\", Table1326172091221[[Duration ]]), 0))))> 90)","v":false}]
[null,null,"",null,null,null,null,{"$f":"IF( B91 > $D$83+14, SUMIFS($G$86:G91, $D$86:D91,\"Direct/Indirect/Clinical Administration\", $B$86:B91,\">\"&$D$83 + 14) + ((IF(SUMIF(Table1326172091221[Type of Care], \"QI\", Table1326172091221[[Duration ]])>= 4, 4,IF(SUMIF(Table1326172091221[Type of Care], \"QI\", Table1326172091221[[Duration ]])<= 3, SUMIF(Table1326172091221[Type of Care], \"QI\", Table1326172091221[[Duration ]]), 0))))  > 90, SUMIFS($G$86:G91, $D$86:D91,\"Direct/Indirect/Clinical Administration\",  $B$86:B91,\"<=\"&$D$83 + 14)+ ((IF(SUMIF(Table1326172091221[Type of Care], \"QI\", Table1326172091221[[Duration ]])>= 4, 4,IF(SUMIF(Table1326172091221[Type of Care], \"QI\", Table1326172091221[[Duration ]])<= 3, SUMIF(Table1326172091221[Type of Care], \"QI\", Table1326172091221[[Duration ]]), 0))))> 90)","v":false}]
[null,null,"",null,null,null,null,{"$f":"IF( B92 > $D$83+14, SUMIFS($G$86:G92, $D$86:D92,\"Direct/Indirect/Clinical Administration\", $B$86:B92,\">\"&$D$83 + 14) + ((IF(SUMIF(Table1326172091221[Type of Care], \"QI\", Table1326172091221[[Duration ]])>= 4, 4,IF(SUMIF(Table1326172091221[Type of Care], \"QI\", Table1326172091221[[Duration ]])<= 3, SUMIF(Table1326172091221[Type of Care], \"QI\", Table1326172091221[[Duration ]]), 0))))  > 90, SUMIFS($G$86:G92, $D$86:D92,\"Direct/Indirect/Clinical Administration\",  $B$86:B92,\"<=\"&$D$83 + 14)+ ((IF(SUMIF(Table1326172091221[Type of Care], \"QI\", Table1326172091221[[Duration ]])>= 4, 4,IF(SUMIF(Table1326172091221[Type of Care], \"QI\", Table1326172091221[[Duration ]])<= 3, SUMIF(Table1326172091221[Type of Care], \"QI\", Table1326172091221[[Duration ]]), 0))))> 90)","v":false}]
[null,null,"",null,null,null,null,{"$f":"IF( B93 > $D$83+14, SUMIFS($G$86:G93, $D$86:D93,\"Direct/Indirect/Clinical Administration\", $B$86:B93,\">\"&$D$83 + 14) + ((IF(SUMIF(Table1326172091221[Type of Care], \"QI\", Table1326172091221[[Duration ]])>= 4, 4,IF(SUMIF(Table1326172091221[Type of Care], \"QI\", Table1326172091221[[Duration ]])<= 3, SUMIF(Table1326172091221[Type of Care], \"QI\", Table1326172091221[[Duration ]]), 0))))  > 90, SUMIFS($G$86:G93, $D$86:D93,\"Direct/Indirect/Clinical Administration\",  $B$86:B93,\"<=\"&$D$83 + 14)+ ((IF(SUMIF(Table1326172091221[Type of Care], \"QI\", Table1326172091221[[Duration ]])>= 4, 4,IF(SUMIF(Table1326172091221[Type of Care], \"QI\", Table1326172091221[[Duration ]])<= 3, SUMIF(Table1326172091221[Type of Care], \"QI\", Table1326172091221[[Duration ]]), 0))))> 90)","v":false}]
[null,null,"",null,null,null,null,{"$f":"IF( B94 > $D$83+14, SUMIFS($G$86:G94, $D$86:D94,\"Direct/Indirect/Clinical Administration\", $B$86:B94,\">\"&$D$83 + 14) + ((IF(SUMIF(Table1326172091221[Type of Care], \"QI\", Table1326172091221[[Duration ]])>= 4, 4,IF(SUMIF(Table1326172091221[Type of Care], \"QI\", Table1326172091221[[Duration ]])<= 3, SUMIF(Table1326172091221[Type of Care], \"QI\", Table1326172091221[[Duration ]]), 0))))  > 90, SUMIFS($G$86:G94, $D$86:D94,\"Direct/Indirect/Clinical Administration\",  $B$86:B94,\"<=\"&$D$83 + 14)+ ((IF(SUMIF(Table1326172091221[Type of Care], \"QI\", Table1326172091221[[Duration ]])>= 4, 4,IF(SUMIF(Table1326172091221[Type of Care], \"QI\", Table1326172091221[[Duration ]])<= 3, SUMIF(Table1326172091221[Type of Care], \"QI\", Table1326172091221[[Duration ]]), 0))))> 90)","v":false}]
[null,null,"",null,null,null,null,{"$f":"IF( B95 > $D$83+14, SUMIFS($G$86:G95, $D$86:D95,\"Direct/Indirect/Clinical Administration\", $B$86:B95,\">\"&$D$83 + 14) + ((IF(SUMIF(Table1326172091221[Type of Care], \"QI\", Table1326172091221[[Duration ]])>= 4, 4,IF(SUMIF(Table1326172091221[Type of Care], \"QI\", Table1326172091221[[Duration ]])<= 3, SUMIF(Table1326172091221[Type of Care], \"QI\", Table1326172091221[[Duration ]]), 0))))  > 90, SUMIFS($G$86:G95, $D$86:D95,\"Direct/Indirect/Clinical Administration\",  $B$86:B95,\"<=\"&$D$83 + 14)+ ((IF(SUMIF(Table1326172091221[Type of Care], \"QI\", Table1326172091221[[Duration ]])>= 4, 4,IF(SUMIF(Table1326172091221[Type of Care], \"QI\", Table1326172091221[[Duration ]])<= 3, SUMIF(Table1326172091221[Type of Care], \"QI\", Table1326172091221[[Duration ]]), 0))))> 90)","v":false}]
[null,null,"",null,null,null,null,{"$f":"IF( B96 > $D$83+14, SUMIFS($G$86:G96, $D$86:D96,\"Direct/Indirect/Clinical Administration\", $B$86:B96,\">\"&$D$83 + 14) + ((IF(SUMIF(Table1326172091221[Type of Care], \"QI\", Table1326172091221[[Duration ]])>= 4, 4,IF(SUMIF(Table1326172091221[Type of Care], \"QI\", Table1326172091221[[Duration ]])<= 3, SUMIF(Table1326172091221[Type of Care], \"QI\", Table1326172091221[[Duration ]]), 0))))  > 90, SUMIFS($G$86:G96, $D$86:D96,\"Direct/Indirect/Clinical Administration\",  $B$86:B96,\"<=\"&$D$83 + 14)+ ((IF(SUMIF(Table1326172091221[Type of Care], \"QI\", Table1326172091221[[Duration ]])>= 4, 4,IF(SUMIF(Table1326172091221[Type of Care], \"QI\", Table1326172091221[[Duration ]])<= 3, SUMIF(Table1326172091221[Type of Care], \"QI\", Table1326172091221[[Duration ]]), 0))))> 90)","v":false}]
[null,null,"",null,null,null,null,{"$f":"IF( B97 > $D$83+14, SUMIFS($G$86:G97, $D$86:D97,\"Direct/Indirect/Clinical Administration\", $B$86:B97,\">\"&$D$83 + 14) + ((IF(SUMIF(Table1326172091221[Type of Care], \"QI\", Table1326172091221[[Duration ]])>= 4, 4,IF(SUMIF(Table1326172091221[Type of Care], \"QI\", Table1326172091221[[Duration ]])<= 3, SUMIF(Table1326172091221[Type of Care], \"QI\", Table1326172091221[[Duration ]]), 0))))  > 90, SUMIFS($G$86:G97, $D$86:D97,\"Direct/Indirect/Clinical Administration\",  $B$86:B97,\"<=\"&$D$83 + 14)+ ((IF(SUMIF(Table1326172091221[Type of Care], \"QI\", Table1326172091221[[Duration ]])>= 4, 4,IF(SUMIF(Table1326172091221[Type of Care], \"QI\", Table1326172091221[[Duration ]])<= 3, SUMIF(Table1326172091221[Type of Care], \"QI\", Table1326172091221[[Duration ]]), 0))))> 90)","v":false}]
[null,null,"",null,null,null,null,{"$f":"IF( B98 > $D$83+14, SUMIFS($G$86:G98, $D$86:D98,\"Direct/Indirect/Clinical Administration\", $B$86:B98,\">\"&$D$83 + 14) + ((IF(SUMIF(Table1326172091221[Type of Care], \"QI\", Table1326172091221[[Duration ]])>= 4, 4,IF(SUMIF(Table1326172091221[Type of Care], \"QI\", Table1326172091221[[Duration ]])<= 3, SUMIF(Table1326172091221[Type of Care], \"QI\", Table1326172091221[[Duration ]]), 0))))  > 90, SUMIFS($G$86:G98, $D$86:D98,\"Direct/Indirect/Clinical Administration\",  $B$86:B98,\"<=\"&$D$83 + 14)+ ((IF(SUMIF(Table1326172091221[Type of Care], \"QI\", Table1326172091221[[Duration ]])>= 4, 4,IF(SUMIF(Table1326172091221[Type of Care], \"QI\", Table1326172091221[[Duration ]])<= 3, SUMIF(Table1326172091221[Type of Care], \"QI\", Table1326172091221[[Duration ]]), 0))))> 90)","v":false}]
[null,null,"",null,null,null,null,{"$f":"IF( B99 > $D$83+14, SUMIFS($G$86:G99, $D$86:D99,\"Direct/Indirect/Clinical Administration\", $B$86:B99,\">\"&$D$83 + 14) + ((IF(SUMIF(Table1326172091221[Type of Care], \"QI\", Table1326172091221[[Duration ]])>= 4, 4,IF(SUMIF(Table1326172091221[Type of Care], \"QI\", Table1326172091221[[Duration ]])<= 3, SUMIF(Table1326172091221[Type of Care], \"QI\", Table1326172091221[[Duration ]]), 0))))  > 90, SUMIFS($G$86:G99, $D$86:D99,\"Direct/Indirect/Clinical Administration\",  $B$86:B99,\"<=\"&$D$83 + 14)+ ((IF(SUMIF(Table1326172091221[Type of Care], \"QI\", Table1326172091221[[Duration ]])>= 4, 4,IF(SUMIF(Table1326172091221[Type of Care], \"QI\", Table1326172091221[[Duration ]])<= 3, SUMIF(Table1326172091221[Type of Care], \"QI\", Table1326172091221[[Duration ]]), 0))))> 90)","v":false}]
[null,null,"",null,null,null,null,{"$f":"IF( B100 > $D$83+14, SUMIFS($G$86:G100, $D$86:D100,\"Direct/Indirect/Clinical Administration\", $B$86:B100,\">\"&$D$83 + 14) + ((IF(SUMIF(Table1326172091221[Type of Care], \"QI\", Table1326172091221[[Duration ]])>= 4, 4,IF(SUMIF(Table1326172091221[Type of Care], \"QI\", Table1326172091221[[Duration ]])<= 3, SUMIF(Table1326172091221[Type of Care], \"QI\", Table1326172091221[[Duration ]]), 0))))  > 90, SUMIFS($G$86:G100, $D$86:D100,\"Direct/Indirect/Clinical Administration\",  $B$86:B100,\"<=\"&$D$83 + 14)+ ((IF(SUMIF(Table1326172091221[Type of Care], \"QI\", Table1326172091221[[Duration ]])>= 4, 4,IF(SUMIF(Table1326172091221[Type of Care], \"QI\", Table1326172091221[[Duration ]])<= 3, SUMIF(Table1326172091221[Type of Care], \"QI\", Table1326172091221[[Duration ]]), 0))))> 90)","v":false}]
[null,null,"",null,null,null,null,{"$f":"IF( B101 > $D$83+14, SUMIFS($G$86:G101, $D$86:D101,\"Direct/Indirect/Clinical Administration\", $B$86:B101,\">\"&$D$83 + 14) + ((IF(SUMIF(Table1326172091221[Type of Care], \"QI\", Table1326172091221[[Duration ]])>= 4, 4,IF(SUMIF(Table1326172091221[Type of Care], \"QI\", Table1326172091221[[Duration ]])<= 3, SUMIF(Table1326172091221[Type of Care], \"QI\", Table1326172091221[[Duration ]]), 0))))  > 90, SUMIFS($G$86:G101, $D$86:D101,\"Direct/Indirect/Clinical Administration\",  $B$86:B101,\"<=\"&$D$83 + 14)+ ((IF(SUMIF(Table1326172091221[Type of Care], \"QI\", Table1326172091221[[Duration ]])>= 4, 4,IF(SUMIF(Table1326172091221[Type of Care], \"QI\", Table1326172091221[[Duration ]])<= 3, SUMIF(Table1326172091221[Type of Care], \"QI\", Table1326172091221[[Duration ]]), 0))))> 90)","v":false}]
[null,null,"",null,null,null,null,{"$f":"IF( B102 > $D$83+14, SUMIFS($G$86:G102, $D$86:D102,\"Direct/Indirect/Clinical Administration\", $B$86:B102,\">\"&$D$83 + 14) + ((IF(SUMIF(Table1326172091221[Type of Care], \"QI\", Table1326172091221[[Duration ]])>= 4, 4,IF(SUMIF(Table1326172091221[Type of Care], \"QI\", Table1326172091221[[Duration ]])<= 3, SUMIF(Table1326172091221[Type of Care], \"QI\", Table1326172091221[[Duration ]]), 0))))  > 90, SUMIFS($G$86:G102, $D$86:D102,\"Direct/Indirect/Clinical Administration\",  $B$86:B102,\"<=\"&$D$83 + 14)+ ((IF(SUMIF(Table1326172091221[Type of Care], \"QI\", Table1326172091221[[Duration ]])>= 4, 4,IF(SUMIF(Table1326172091221[Type of Care], \"QI\", Table1326172091221[[Duration ]])<= 3, SUMIF(Table1326172091221[Type of Care], \"QI\", Table1326172091221[[Duration ]]), 0))))> 90)","v":false}]
[null,null,"",null,null,null,null,{"$f":"IF( B103 > $D$83+14, SUMIFS($G$86:G103, $D$86:D103,\"Direct/Indirect/Clinical Administration\", $B$86:B103,\">\"&$D$83 + 14) + ((IF(SUMIF(Table1326172091221[Type of Care], \"QI\", Table1326172091221[[Duration ]])>= 4, 4,IF(SUMIF(Table1326172091221[Type of Care], \"QI\", Table1326172091221[[Duration ]])<= 3, SUMIF(Table1326172091221[Type of Care], \"QI\", Table1326172091221[[Duration ]]), 0))))  > 90, SUMIFS($G$86:G103, $D$86:D103,\"Direct/Indirect/Clinical Administration\",  $B$86:B103,\"<=\"&$D$83 + 14)+ ((IF(SUMIF(Table1326172091221[Type of Care], \"QI\", Table1326172091221[[Duration ]])>= 4, 4,IF(SUMIF(Table1326172091221[Type of Care], \"QI\", Table1326172091221[[Duration ]])<= 3, SUMIF(Table1326172091221[Type of Care], \"QI\", Table1326172091221[[Duration ]]), 0))))> 90)","v":false}]
[null,null,"",null,null,null,null,{"$f":"IF( B104 > $D$83+14, SUMIFS($G$86:G104, $D$86:D104,\"Direct/Indirect/Clinical Administration\", $B$86:B104,\">\"&$D$83 + 14) + ((IF(SUMIF(Table1326172091221[Type of Care], \"QI\", Table1326172091221[[Duration ]])>= 4, 4,IF(SUMIF(Table1326172091221[Type of Care], \"QI\", Table1326172091221[[Duration ]])<= 3, SUMIF(Table1326172091221[Type of Care], \"QI\", Table1326172091221[[Duration ]]), 0))))  > 90, SUMIFS($G$86:G104, $D$86:D104,\"Direct/Indirect/Clinical Administration\",  $B$86:B104,\"<=\"&$D$83 + 14)+ ((IF(SUMIF(Table1326172091221[Type of Care], \"QI\", Table1326172091221[[Duration ]])>= 4, 4,IF(SUMIF(Table1326172091221[Type of Care], \"QI\", Table1326172091221[[Duration ]])<= 3, SUMIF(Table1326172091221[Type of Care], \"QI\", Table1326172091221[[Duration ]]), 0))))> 90)","v":false}]
[null,null,"",null,null,null,null,{"$f":"IF( B105 > $D$83+14, SUMIFS($G$86:G105, $D$86:D105,\"Direct/Indirect/Clinical Administration\", $B$86:B105,\">\"&$D$83 + 14) + ((IF(SUMIF(Table1326172091221[Type of Care], \"QI\", Table1326172091221[[Duration ]])>= 4, 4,IF(SUMIF(Table1326172091221[Type of Care], \"QI\", Table1326172091221[[Duration ]])<= 3, SUMIF(Table1326172091221[Type of Care], \"QI\", Table1326172091221[[Duration ]]), 0))))  > 90, SUMIFS($G$86:G105, $D$86:D105,\"Direct/Indirect/Clinical Administration\",  $B$86:B105,\"<=\"&$D$83 + 14)+ ((IF(SUMIF(Table1326172091221[Type of Care], \"QI\", Table1326172091221[[Duration ]])>= 4, 4,IF(SUMIF(Table1326172091221[Type of Care], \"QI\", Table1326172091221[[Duration ]])<= 3, SUMIF(Table1326172091221[Type of Care], \"QI\", Table1326172091221[[Duration ]]), 0))))> 90)","v":false}]
[null,null,"",null,null,null,null,{"$f":"IF( B106 > $D$83+14, SUMIFS($G$86:G106, $D$86:D106,\"Direct/Indirect/Clinical Administration\", $B$86:B106,\">\"&$D$83 + 14) + ((IF(SUMIF(Table1326172091221[Type of Care], \"QI\", Table1326172091221[[Duration ]])>= 4, 4,IF(SUMIF(Table1326172091221[Type of Care], \"QI\", Table1326172091221[[Duration ]])<= 3, SUMIF(Table1326172091221[Type of Care], \"QI\", Table1326172091221[[Duration ]]), 0))))  > 90, SUMIFS($G$86:G106, $D$86:D106,\"Direct/Indirect/Clinical Administration\",  $B$86:B106,\"<=\"&$D$83 + 14)+ ((IF(SUMIF(Table1326172091221[Type of Care], \"QI\", Table1326172091221[[Duration ]])>= 4, 4,IF(SUMIF(Table1326172091221[Type of Care], \"QI\", Table1326172091221[[Duration ]])<= 3, SUMIF(Table1326172091221[Type of Care], \"QI\", Table1326172091221[[Duration ]]), 0))))> 90)","v":false}]
[null,null,"",null,null,null,null,{"$f":"IF( B107 > $D$83+14, SUMIFS($G$86:G107, $D$86:D107,\"Direct/Indirect/Clinical Administration\", $B$86:B107,\">\"&$D$83 + 14) + ((IF(SUMIF(Table1326172091221[Type of Care], \"QI\", Table1326172091221[[Duration ]])>= 4, 4,IF(SUMIF(Table1326172091221[Type of Care], \"QI\", Table1326172091221[[Duration ]])<= 3, SUMIF(Table1326172091221[Type of Care], \"QI\", Table1326172091221[[Duration ]]), 0))))  > 90, SUMIFS($G$86:G107, $D$86:D107,\"Direct/Indirect/Clinical Administration\",  $B$86:B107,\"<=\"&$D$83 + 14)+ ((IF(SUMIF(Table1326172091221[Type of Care], \"QI\", Table1326172091221[[Duration ]])>= 4, 4,IF(SUMIF(Table1326172091221[Type of Care], \"QI\", Table1326172091221[[Duration ]])<= 3, SUMIF(Table1326172091221[Type of Care], \"QI\", Table1326172091221[[Duration ]]), 0))))> 90)","v":false}]
[null,null,"",null,null,null,null,{"$f":"IF( B108 > $D$83+14, SUMIFS($G$86:G108, $D$86:D108,\"Direct/Indirect/Clinical Administration\", $B$86:B108,\">\"&$D$83 + 14) + ((IF(SUMIF(Table1326172091221[Type of Care], \"QI\", Table1326172091221[[Duration ]])>= 4, 4,IF(SUMIF(Table1326172091221[Type of Care], \"QI\", Table1326172091221[[Duration ]])<= 3, SUMIF(Table1326172091221[Type of Care], \"QI\", Table1326172091221[[Duration ]]), 0))))  > 90, SUMIFS($G$86:G108, $D$86:D108,\"Direct/Indirect/Clinical Administration\",  $B$86:B108,\"<=\"&$D$83 + 14)+ ((IF(SUMIF(Table1326172091221[Type of Care], \"QI\", Table1326172091221[[Duration ]])>= 4, 4,IF(SUMIF(Table1326172091221[Type of Care], \"QI\", Table1326172091221[[Duration ]])<= 3, SUMIF(Table1326172091221[Type of Care], \"QI\", Table1326172091221[[Duration ]]), 0))))> 90)","v":false}]
[null,null,"",null,null,null,null,{"$f":"IF( B109 > $D$83+14, SUMIFS($G$86:G109, $D$86:D109,\"Direct/Indirect/Clinical Administration\", $B$86:B109,\">\"&$D$83 + 14) + ((IF(SUMIF(Table1326172091221[Type of Care], \"QI\", Table1326172091221[[Duration ]])>= 4, 4,IF(SUMIF(Table1326172091221[Type of Care], \"QI\", Table1326172091221[[Duration ]])<= 3, SUMIF(Table1326172091221[Type of Care], \"QI\", Table1326172091221[[Duration ]]), 0))))  > 90, SUMIFS($G$86:G109, $D$86:D109,\"Direct/Indirect/Clinical Administration\",  $B$86:B109,\"<=\"&$D$83 + 14)+ ((IF(SUMIF(Table1326172091221[Type of Care], \"QI\", Table1326172091221[[Duration ]])>= 4, 4,IF(SUMIF(Table1326172091221[Type of Care], \"QI\", Table1326172091221[[Duration ]])<= 3, SUMIF(Table1326172091221[Type of Care], \"QI\", Table1326172091221[[Duration ]]), 0))))> 90)","v":false}]
[null,null,"",null,null,null,null,{"$f":"IF( B110 > $D$83+14, SUMIFS($G$86:G110, $D$86:D110,\"Direct/Indirect/Clinical Administration\", $B$86:B110,\">\"&$D$83 + 14) + ((IF(SUMIF(Table1326172091221[Type of Care], \"QI\", Table1326172091221[[Duration ]])>= 4, 4,IF(SUMIF(Table1326172091221[Type of Care], \"QI\", Table1326172091221[[Duration ]])<= 3, SUMIF(Table1326172091221[Type of Care], \"QI\", Table1326172091221[[Duration ]]), 0))))  > 90, SUMIFS($G$86:G110, $D$86:D110,\"Direct/Indirect/Clinical Administration\",  $B$86:B110,\"<=\"&$D$83 + 14)+ ((IF(SUMIF(Table1326172091221[Type of Care], \"QI\", Table1326172091221[[Duration ]])>= 4, 4,IF(SUMIF(Table1326172091221[Type of Care], \"QI\", Table1326172091221[[Duration ]])<= 3, SUMIF(Table1326172091221[Type of Care], \"QI\", Table1326172091221[[Duration ]]), 0))))> 90)","v":false}]
[null,null,"",null,null,null,null,{"$f":"IF( B111 > $D$83+14, SUMIFS($G$86:G111, $D$86:D111,\"Direct/Indirect/Clinical Administration\", $B$86:B111,\">\"&$D$83 + 14) + ((IF(SUMIF(Table1326172091221[Type of Care], \"QI\", Table1326172091221[[Duration ]])>= 4, 4,IF(SUMIF(Table1326172091221[Type of Care], \"QI\", Table1326172091221[[Duration ]])<= 3, SUMIF(Table1326172091221[Type of Care], \"QI\", Table1326172091221[[Duration ]]), 0))))  > 90, SUMIFS($G$86:G111, $D$86:D111,\"Direct/Indirect/Clinical Administration\",  $B$86:B111,\"<=\"&$D$83 + 14)+ ((IF(SUMIF(Table1326172091221[Type of Care], \"QI\", Table1326172091221[[Duration ]])>= 4, 4,IF(SUMIF(Table1326172091221[Type of Care], \"QI\", Table1326172091221[[Duration ]])<= 3, SUMIF(Table1326172091221[Type of Care], \"QI\", Table1326172091221[[Duration ]]), 0))))> 90)","v":false}]
[null,null,"",null,null,null,null,{"$f":"IF( B112 > $D$83+14, SUMIFS($G$86:G112, $D$86:D112,\"Direct/Indirect/Clinical Administration\", $B$86:B112,\">\"&$D$83 + 14) + ((IF(SUMIF(Table1326172091221[Type of Care], \"QI\", Table1326172091221[[Duration ]])>= 4, 4,IF(SUMIF(Table1326172091221[Type of Care], \"QI\", Table1326172091221[[Duration ]])<= 3, SUMIF(Table1326172091221[Type of Care], \"QI\", Table1326172091221[[Duration ]]), 0))))  > 90, SUMIFS($G$86:G112, $D$86:D112,\"Direct/Indirect/Clinical Administration\",  $B$86:B112,\"<=\"&$D$83 + 14)+ ((IF(SUMIF(Table1326172091221[Type of Care], \"QI\", Table1326172091221[[Duration ]])>= 4, 4,IF(SUMIF(Table1326172091221[Type of Care], \"QI\", Table1326172091221[[Duration ]])<= 3, SUMIF(Table1326172091221[Type of Care], \"QI\", Table1326172091221[[Duration ]]), 0))))> 90)","v":false}]
[null,null,"",null,null,null,null,{"$f":"IF( B113 > $D$83+14, SUMIFS($G$86:G113, $D$86:D113,\"Direct/Indirect/Clinical Administration\", $B$86:B113,\">\"&$D$83 + 14) + ((IF(SUMIF(Table1326172091221[Type of Care], \"QI\", Table1326172091221[[Duration ]])>= 4, 4,IF(SUMIF(Table1326172091221[Type of Care], \"QI\", Table1326172091221[[Duration ]])<= 3, SUMIF(Table1326172091221[Type of Care], \"QI\", Table1326172091221[[Duration ]]), 0))))  > 90, SUMIFS($G$86:G113, $D$86:D113,\"Direct/Indirect/Clinical Administration\",  $B$86:B113,\"<=\"&$D$83 + 14)+ ((IF(SUMIF(Table1326172091221[Type of Care], \"QI\", Table1326172091221[[Duration ]])>= 4, 4,IF(SUMIF(Table1326172091221[Type of Care], \"QI\", Table1326172091221[[Duration ]])<= 3, SUMIF(Table1326172091221[Type of Care], \"QI\", Table1326172091221[[Duration ]]), 0))))> 90)","v":false}]
[null,null,"",null,null,null,null,{"$f":"IF( B114 > $D$83+14, SUMIFS($G$86:G114, $D$86:D114,\"Direct/Indirect/Clinical Administration\", $B$86:B114,\">\"&$D$83 + 14) + ((IF(SUMIF(Table1326172091221[Type of Care], \"QI\", Table1326172091221[[Duration ]])>= 4, 4,IF(SUMIF(Table1326172091221[Type of Care], \"QI\", Table1326172091221[[Duration ]])<= 3, SUMIF(Table1326172091221[Type of Care], \"QI\", Table1326172091221[[Duration ]]), 0))))  > 90, SUMIFS($G$86:G114, $D$86:D114,\"Direct/Indirect/Clinical Administration\",  $B$86:B114,\"<=\"&$D$83 + 14)+ ((IF(SUMIF(Table1326172091221[Type of Care], \"QI\", Table1326172091221[[Duration ]])>= 4, 4,IF(SUMIF(Table1326172091221[Type of Care], \"QI\", Table1326172091221[[Duration ]])<= 3, SUMIF(Table1326172091221[Type of Care], \"QI\", Table1326172091221[[Duration ]]), 0))))> 90)","v":false}]
[null,null,{"$f":"IF(B115=\"\", \"\", B115)","v":""},null,null,"Total Contract Hours",{"$f":"(SUMIF(Table1326172091221[Type of Care], \"Direct/Indirect/Clinical Administration\",Table1326172091221[[Duration ]]))","v":0},"CT3"]
[null,null,null,null,null,"Total Included QI Hours",{"$f":"(IF(SUMIF(Table1326172091221[Type of Care], \"QI\", Table1326172091221[[Duration ]])>= 4, 4,IF(SUMIF(Table1326172091221[Type of Care], \"QI\", Table1326172091221[[Duration ]])<= 3, SUMIF(Table1326172091221[Type of Care], \"QI\", Table1326172091221[[Duration ]]), 0)))","v":0},"QI3"]
[null,null,null,null,null,"Total Excluded Hours",{"$f":"G118+G119","v":0},"EX3"]
[null,null,null,null,null,"         Excluded Contract Hours",{"$f":"(SUMIF(Table1326172091221[Type of Care], \"Third Party/Specialist FFS\",Table1326172091221[[Duration ]])) + (SUMIF(Table1326172091221[Type of Care], \"Break (>15 Minutes)\", Table1326172091221[[Duration ]]))","v":0},"EXC3"]
[null,null,null,null,null,"      Excluded QI Hours",{"$f":"(SUMIF(Table1326172091221[Type of Care], \"QI\", Table1326172091221[[Duration ]]) - (IF(SUMIF(Table1326172091221[Type of Care], \"QI\", Table1326172091221[[Duration ]])>= 4, 4,IF(SUMIF(Table1326172091221[Type of Care], \"QI\", Table1326172091221[[Duration ]])<= 3, SUMIF(Table1326172091221[Type of Care], \"QI\", Table1326172091221[[Duration ]]), 0))))","v":0},"EXQI3"]
[null,null,{"$f":"IF(B120=\"\", \"\", B120)","v":""},null,null,"Hours Above 90hr/semi-monthly",{"$f":"  (IF(SUMIFS(Table1326172091221[[Duration ]],Table1326172091221[Date (YYYY-MM-DD)], \">\"&$D$83+14, Table1326172091221[Type of Care], \"Direct/Indirect/Clinical Administration\")>= 90, (SUMIFS(Table1326172091221[[Duration ]],Table1326172091221[Date (YYYY-MM-DD)], \">\"&$D$83+14, Table1326172091221[Type of Care], \"Direct/Indirect/Clinical Administration\")+ (IF(SUMIF(Table1326172091221[Type of Care], \"QI\", Table1326172091221[[Duration ]])>= 4, 4,IF(SUMIF(Table1326172091221[Type of Care], \"QI\", Table1326172091221[[Duration ]])<= 3, SUMIF(Table1326172091221[Type of Care], \"QI\",Table1326172091221[[Duration ]]), 0))) -90))) + (IF(SUMIFS(Table1326172091221[[Duration ]],Table1326172091221[Date (YYYY-MM-DD)], \"<=\"&$D$83+14, Table1326172091221[Type of Care], \"Direct/Indirect/Clinical Administration\")>= 90, (SUMIFS(Table1326172091221[[Duration ]],Table1326172091221[Date (YYYY-MM-DD)], \"<=\"&$D$83+14, Table1326172091221[Type of Care], \"Direct/Indirect/Clinical Administration\")+ (IF(SUMIF(Table1326172091221[Type of Care], \"QI\", Table1326172091221[[Duration ]])>= 4, 4,IF(SUMIF(Table1326172091221[Type of Care], \"QI\", Table1326172091221[[Duration ]])<= 3, SUMIF(Table1326172091221[Type of Care], \"QI\",Table1326172091221[[Duration ]]), 0))) -90)))","v":0},"A903"]

{"sheet":"Physician 7","index":7,"n_rows":120,"n_cols":8,"rows_kept":120,"cut":false,"hidden":false,"merged":[]}
[]
[null,"[Physician Name]"]
[null,"Practitioner #:",0]
[null,"Annual Rate: ",0]
[null,"Qrt. Disbursement: ",0]
[null,null,"Jan - Mar"]
[null,"Total Contract \nHours","Total Included \nQI Hours","Excluded Contract \nHours"]
[null,{"$f":"G35+G75+G115","v":0},{"$f":"G36+G76+G116","v":0},{"$f":"G37+G77+G117","v":0},null,null,null,"Totals"]
[]
[null,{"$f":"IF(Clinic!C5=\"Jan - Mar\", \"January\", IF(Clinic!C5= \"Apr - June\", \"April\", IF(Clinic!C5=\"July - Sept\", \"July\", IF(Clinic!C5=\" Oct - Dec\", \"October\"))))","v":"January"},{"$f":"Clinic!C6","v":2021},{"$f":"DATE(YEAR(B13),MONTH(DATEVALUE(B10&\"1\")),1)","v":"1900-01-01"},null,null,null,"Month1"]
[]
[null,"Date (YYYY-MM-DD)","Day ","Type of Care","Start Time AM/PM","End Time AM/PM","Duration","FALSE/TRUE"]
[null,null,{"$f":"IF(B13=\"\", \"\", B13)","v":""},null,null,null,null,{"$f":"IF( B13 > $D$10+14, SUMIFS($G$13:G13, $D$13:D13,\"Direct/Indirect/Clinical Administration\", $B$13:B13,\">\"&$D$10 + 14) + ((IF(SUMIF(Table1315187101322[Type of Care], \"QI\", Table1315187101322[Duration])>= 4, 4,IF(SUMIF(Table1315187101322[Type of Care], \"QI\", Table1315187101322[Duration])<= 3, SUMIF(Table1315187101322[Type of Care], \"QI\", Table1315187101322[Duration]), 0))))  > 90, SUMIFS($G$13:G13, $D$13:D13,\"Direct/Indirect/Clinical Administration\",  $B$13:B13,\"<=\"&$D$10 + 14)+ ((IF(SUMIF(Table1315187101322[Type of Care], \"QI\", Table1315187101322[Duration])>= 4, 4,IF(SUMIF(Table1315187101322[Type of Care], \"QI\", Table1315187101322[Duration])<= 3, SUMIF(Table1315187101322[Type of Care], \"QI\", Table1315187101322[Duration]), 0))))> 90)","v":false}]
[null,null,{"$f":"IF(B14=\"\", \"\", B14)","v":""},null,null,null,null,{"$f":"IF( B14 > $D$10+14, SUMIFS($G$13:G14, $D$13:D14,\"Direct/Indirect/Clinical Administration\", $B$13:B14,\">\"&$D$10 + 14) + ((IF(SUMIF(Table1315187101322[Type of Care], \"QI\", Table1315187101322[Duration])>= 4, 4,IF(SUMIF(Table1315187101322[Type of Care], \"QI\", Table1315187101322[Duration])<= 3, SUMIF(Table1315187101322[Type of Care], \"QI\", Table1315187101322[Duration]), 0))))  > 90, SUMIFS($G$13:G14, $D$13:D14,\"Direct/Indirect/Clinical Administration\",  $B$13:B14,\"<=\"&$D$10 + 14)+ ((IF(SUMIF(Table1315187101322[Type of Care], \"QI\", Table1315187101322[Duration])>= 4, 4,IF(SUMIF(Table1315187101322[Type of Care], \"QI\", Table1315187101322[Duration])<= 3, SUMIF(Table1315187101322[Type of Care], \"QI\", Table1315187101322[Duration]), 0))))> 90)","v":false}]
[null,null,"",null,null,null,null,{"$f":"IF( B15 > $D$10+14, SUMIFS($G$13:G15, $D$13:D15,\"Direct/Indirect/Clinical Administration\", $B$13:B15,\">\"&$D$10 + 14) + ((IF(SUMIF(Table1315187101322[Type of Care], \"QI\", Table1315187101322[Duration])>= 4, 4,IF(SUMIF(Table1315187101322[Type of Care], \"QI\", Table1315187101322[Duration])<= 3, SUMIF(Table1315187101322[Type of Care], \"QI\", Table1315187101322[Duration]), 0))))  > 90, SUMIFS($G$13:G15, $D$13:D15,\"Direct/Indirect/Clinical Administration\",  $B$13:B15,\"<=\"&$D$10 + 14)+ ((IF(SUMIF(Table1315187101322[Type of Care], \"QI\", Table1315187101322[Duration])>= 4, 4,IF(SUMIF(Table1315187101322[Type of Care], \"QI\", Table1315187101322[Duration])<= 3, SUMIF(Table1315187101322[Type of Care], \"QI\", Table1315187101322[Duration]), 0))))> 90)","v":false}]
[null,null,"",null,null,null,null,{"$f":"IF( B16 > $D$10+14, SUMIFS($G$13:G16, $D$13:D16,\"Direct/Indirect/Clinical Administration\", $B$13:B16,\">\"&$D$10 + 14) + ((IF(SUMIF(Table1315187101322[Type of Care], \"QI\", Table1315187101322[Duration])>= 4, 4,IF(SUMIF(Table1315187101322[Type of Care], \"QI\", Table1315187101322[Duration])<= 3, SUMIF(Table1315187101322[Type of Care], \"QI\", Table1315187101322[Duration]), 0))))  > 90, SUMIFS($G$13:G16, $D$13:D16,\"Direct/Indirect/Clinical Administration\",  $B$13:B16,\"<=\"&$D$10 + 14)+ ((IF(SUMIF(Table1315187101322[Type of Care], \"QI\", Table1315187101322[Duration])>= 4, 4,IF(SUMIF(Table1315187101322[Type of Care], \"QI\", Table1315187101322[Duration])<= 3, SUMIF(Table1315187101322[Type of Care], \"QI\", Table1315187101322[Duration]), 0))))> 90)","v":false}]
[null,null,"",null,null,null,null,{"$f":"IF( B17 > $D$10+14, SUMIFS($G$13:G17, $D$13:D17,\"Direct/Indirect/Clinical Administration\", $B$13:B17,\">\"&$D$10 + 14) + ((IF(SUMIF(Table1315187101322[Type of Care], \"QI\", Table1315187101322[Duration])>= 4, 4,IF(SUMIF(Table1315187101322[Type of Care], \"QI\", Table1315187101322[Duration])<= 3, SUMIF(Table1315187101322[Type of Care], \"QI\", Table1315187101322[Duration]), 0))))  > 90, SUMIFS($G$13:G17, $D$13:D17,\"Direct/Indirect/Clinical Administration\",  $B$13:B17,\"<=\"&$D$10 + 14)+ ((IF(SUMIF(Table1315187101322[Type of Care], \"QI\", Table1315187101322[Duration])>= 4, 4,IF(SUMIF(Table1315187101322[Type of Care], \"QI\", Table1315187101322[Duration])<= 3, SUMIF(Table1315187101322[Type of Care], \"QI\", Table1315187101322[Duration]), 0))))> 90)","v":false}]
[null,null,"",null,null,null,null,{"$f":"IF( B18 > $D$10+14, SUMIFS($G$13:G18, $D$13:D18,\"Direct/Indirect/Clinical Administration\", $B$13:B18,\">\"&$D$10 + 14) + ((IF(SUMIF(Table1315187101322[Type of Care], \"QI\", Table1315187101322[Duration])>= 4, 4,IF(SUMIF(Table1315187101322[Type of Care], \"QI\", Table1315187101322[Duration])<= 3, SUMIF(Table1315187101322[Type of Care], \"QI\", Table1315187101322[Duration]), 0))))  > 90, SUMIFS($G$13:G18, $D$13:D18,\"Direct/Indirect/Clinical Administration\",  $B$13:B18,\"<=\"&$D$10 + 14)+ ((IF(SUMIF(Table1315187101322[Type of Care], \"QI\", Table1315187101322[Duration])>= 4, 4,IF(SUMIF(Table1315187101322[Type of Care], \"QI\", Table1315187101322[Duration])<= 3, SUMIF(Table1315187101322[Type of Care], \"QI\", Table1315187101322[Duration]), 0))))> 90)","v":false}]
[null,null,"",null,null,null,null,{"$f":"IF( B19 > $D$10+14, SUMIFS($G$13:G19, $D$13:D19,\"Direct/Indirect/Clinical Administration\", $B$13:B19,\">\"&$D$10 + 14) + ((IF(SUMIF(Table1315187101322[Type of Care], \"QI\", Table1315187101322[Duration])>= 4, 4,IF(SUMIF(Table1315187101322[Type of Care], \"QI\", Table1315187101322[Duration])<= 3, SUMIF(Table1315187101322[Type of Care], \"QI\", Table1315187101322[Duration]), 0))))  > 90, SUMIFS($G$13:G19, $D$13:D19,\"Direct/Indirect/Clinical Administration\",  $B$13:B19,\"<=\"&$D$10 + 14)+ ((IF(SUMIF(Table1315187101322[Type of Care], \"QI\", Table1315187101322[Duration])>= 4, 4,IF(SUMIF(Table1315187101322[Type of Care], \"QI\", Table1315187101322[Duration])<= 3, SUMIF(Table1315187101322[Type of Care], \"QI\", Table1315187101322[Duration]), 0))))> 90)","v":false}]
[null,null,"",null,null,null,null,{"$f":"IF( B20 > $D$10+14, SUMIFS($G$13:G20, $D$13:D20,\"Direct/Indirect/Clinical Administration\", $B$13:B20,\">\"&$D$10 + 14) + ((IF(SUMIF(Table1315187101322[Type of Care], \"QI\", Table1315187101322[Duration])>= 4, 4,IF(SUMIF(Table1315187101322[Type of Care], \"QI\", Table1315187101322[Duration])<= 3, SUMIF(Table1315187101322[Type of Care], \"QI\", Table1315187101322[Duration]), 0))))  > 90, SUMIFS($G$13:G20, $D$13:D20,\"Direct/Indirect/Clinical Administration\",  $B$13:B20,\"<=\"&$D$10 + 14)+ ((IF(SUMIF(Table1315187101322[Type of Care], \"QI\", Table1315187101322[Duration])>= 4, 4,IF(SUMIF(Table1315187101322[Type of Care], \"QI\", Table1315187101322[Duration])<= 3, SUMIF(Table1315187101322[Type of Care], \"QI\", Table1315187101322[Duration]), 0))))> 90)","v":false}]
[null,null,"",null,null,null,null,{"$f":"IF( B21 > $D$10+14, SUMIFS($G$13:G21, $D$13:D21,\"Direct/Indirect/Clinical Administration\", $B$13:B21,\">\"&$D$10 + 14) + ((IF(SUMIF(Table1315187101322[Type of Care], \"QI\", Table1315187101322[Duration])>= 4, 4,IF(SUMIF(Table1315187101322[Type of Care], \"QI\", Table1315187101322[Duration])<= 3, SUMIF(Table1315187101322[Type of Care], \"QI\", Table1315187101322[Duration]), 0))))  > 90, SUMIFS($G$13:G21, $D$13:D21,\"Direct/Indirect/Clinical Administration\",  $B$13:B21,\"<=\"&$D$10 + 14)+ ((IF(SUMIF(Table1315187101322[Type of Care], \"QI\", Table1315187101322[Duration])>= 4, 4,IF(SUMIF(Table1315187101322[Type of Care], \"QI\", Table1315187101322[Duration])<= 3, SUMIF(Table1315187101322[Type of Care], \"QI\", Table1315187101322[Duration]), 0))))> 90)","v":false}]
[null,null,"",null,null,null,null,{"$f":"IF( B22 > $D$10+14, SUMIFS($G$13:G22, $D$13:D22,\"Direct/Indirect/Clinical Administration\", $B$13:B22,\">\"&$D$10 + 14) + ((IF(SUMIF(Table1315187101322[Type of Care], \"QI\", Table1315187101322[Duration])>= 4, 4,IF(SUMIF(Table1315187101322[Type of Care], \"QI\", Table1315187101322[Duration])<= 3, SUMIF(Table1315187101322[Type of Care], \"QI\", Table1315187101322[Duration]), 0))))  > 90, SUMIFS($G$13:G22, $D$13:D22,\"Direct/Indirect/Clinical Administration\",  $B$13:B22,\"<=\"&$D$10 + 14)+ ((IF(SUMIF(Table1315187101322[Type of Care], \"QI\", Table1315187101322[Duration])>= 4, 4,IF(SUMIF(Table1315187101322[Type of Care], \"QI\", Table1315187101322[Duration])<= 3, SUMIF(Table1315187101322[Type of Care], \"QI\", Table1315187101322[Duration]), 0))))> 90)","v":false}]
[null,null,"",null,null,null,null,{"$f":"IF( B23 > $D$10+14, SUMIFS($G$13:G23, $D$13:D23,\"Direct/Indirect/Clinical Administration\", $B$13:B23,\">\"&$D$10 + 14) + ((IF(SUMIF(Table1315187101322[Type of Care], \"QI\", Table1315187101322[Duration])>= 4, 4,IF(SUMIF(Table1315187101322[Type of Care], \"QI\", Table1315187101322[Duration])<= 3, SUMIF(Table1315187101322[Type of Care], \"QI\", Table1315187101322[Duration]), 0))))  > 90, SUMIFS($G$13:G23, $D$13:D23,\"Direct/Indirect/Clinical Administration\",  $B$13:B23,\"<=\"&$D$10 + 14)+ ((IF(SUMIF(Table1315187101322[Type of Care], \"QI\", Table1315187101322[Duration])>= 4, 4,IF(SUMIF(Table1315187101322[Type of Care], \"QI\", Table1315187101322[Duration])<= 3, SUMIF(Table1315187101322[Type of Care], \"QI\", Table1315187101322[Duration]), 0))))> 90)","v":false}]
[null,null,"",null,null,null,null,{"$f":"IF( B24 > $D$10+14, SUMIFS($G$13:G24, $D$13:D24,\"Direct/Indirect/Clinical Administration\", $B$13:B24,\">\"&$D$10 + 14) + ((IF(SUMIF(Table1315187101322[Type of Care], \"QI\", Table1315187101322[Duration])>= 4, 4,IF(SUMIF(Table1315187101322[Type of Care], \"QI\", Table1315187101322[Duration])<= 3, SUMIF(Table1315187101322[Type of Care], \"QI\", Table1315187101322[Duration]), 0))))  > 90, SUMIFS($G$13:G24, $D$13:D24,\"Direct/Indirect/Clinical Administration\",  $B$13:B24,\"<=\"&$D$10 + 14)+ ((IF(SUMIF(Table1315187101322[Type of Care], \"QI\", Table1315187101322[Duration])>= 4, 4,IF(SUMIF(Table1315187101322[Type of Care], \"QI\", Table1315187101322[Duration])<= 3, SUMIF(Table1315187101322[Type of Care], \"QI\", Table1315187101322[Duration]), 0))))> 90)","v":false}]
[null,null,"",null,null,null,null,{"$f":"IF( B25 > $D$10+14, SUMIFS($G$13:G25, $D$13:D25,\"Direct/Indirect/Clinical Administration\", $B$13:B25,\">\"&$D$10 + 14) + ((IF(SUMIF(Table1315187101322[Type of Care], \"QI\", Table1315187101322[Duration])>= 4, 4,IF(SUMIF(Table1315187101322[Type of Care], \"QI\", Table1315187101322[Duration])<= 3, SUMIF(Table1315187101322[Type of Care], \"QI\", Table1315187101322[Duration]), 0))))  > 90, SUMIFS($G$13:G25, $D$13:D25,\"Direct/Indirect/Clinical Administration\",  $B$13:B25,\"<=\"&$D$10 + 14)+ ((IF(SUMIF(Table1315187101322[Type of Care], \"QI\", Table1315187101322[Duration])>= 4, 4,IF(SUMIF(Table1315187101322[Type of Care], \"QI\", Table1315187101322[Duration])<= 3, SUMIF(Table1315187101322[Type of Care], \"QI\", Table1315187101322[Duration]), 0))))> 90)","v":false}]
[null,null,"",null,null,null,null,{"$f":"IF( B26 > $D$10+14, SUMIFS($G$13:G26, $D$13:D26,\"Direct/Indirect/Clinical Administration\", $B$13:B26,\">\"&$D$10 + 14) + ((IF(SUMIF(Table1315187101322[Type of Care], \"QI\", Table1315187101322[Duration])>= 4, 4,IF(SUMIF(Table1315187101322[Type of Care], \"QI\", Table1315187101322[Duration])<= 3, SUMIF(Table1315187101322[Type of Care], \"QI\", Table1315187101322[Duration]), 0))))  > 90, SUMIFS($G$13:G26, $D$13:D26,\"Direct/Indirect/Clinical Administration\",  $B$13:B26,\"<=\"&$D$10 + 14)+ ((IF(SUMIF(Table1315187101322[Type of Care], \"QI\", Table1315187101322[Duration])>= 4, 4,IF(SUMIF(Table1315187101322[Type of Care], \"QI\", Table1315187101322[Duration])<= 3, SUMIF(Table1315187101322[Type of Care], \"QI\", Table1315187101322[Duration]), 0))))> 90)","v":false}]
[null,null,"",null,null,null,null,{"$f":"IF( B27 > $D$10+14, SUMIFS($G$13:G27, $D$13:D27,\"Direct/Indirect/Clinical Administration\", $B$13:B27,\">\"&$D$10 + 14) + ((IF(SUMIF(Table1315187101322[Type of Care], \"QI\", Table1315187101322[Duration])>= 4, 4,IF(SUMIF(Table1315187101322[Type of Care], \"QI\", Table1315187101322[Duration])<= 3, SUMIF(Table1315187101322[Type of Care], \"QI\", Table1315187101322[Duration]), 0))))  > 90, SUMIFS($G$13:G27, $D$13:D27,\"Direct/Indirect/Clinical Administration\",  $B$13:B27,\"<=\"&$D$10 + 14)+ ((IF(SUMIF(Table1315187101322[Type of Care], \"QI\", Table1315187101322[Duration])>= 4, 4,IF(SUMIF(Table1315187101322[Type of Care], \"QI\", Table1315187101322[Duration])<= 3, SUMIF(Table1315187101322[Type of Care], \"QI\", Table1315187101322[Duration]), 0))))> 90)","v":false}]
[null,null,"",null,null,null,null,{"$f":"IF( B28 > $D$10+14, SUMIFS($G$13:G28, $D$13:D28,\"Direct/Indirect/Clinical Administration\", $B$13:B28,\">\"&$D$10 + 14) + ((IF(SUMIF(Table1315187101322[Type of Care], \"QI\", Table1315187101322[Duration])>= 4, 4,IF(SUMIF(Table1315187101322[Type of Care], \"QI\", Table1315187101322[Duration])<= 3, SUMIF(Table1315187101322[Type of Care], \"QI\", Table1315187101322[Duration]), 0))))  > 90, SUMIFS($G$13:G28, $D$13:D28,\"Direct/Indirect/Clinical Administration\",  $B$13:B28,\"<=\"&$D$10 + 14)+ ((IF(SUMIF(Table1315187101322[Type of Care], \"QI\", Table1315187101322[Duration])>= 4, 4,IF(SUMIF(Table1315187101322[Type of Care], \"QI\", Table1315187101322[Duration])<= 3, SUMIF(Table1315187101322[Type of Care], \"QI\", Table1315187101322[Duration]), 0))))> 90)","v":false}]
[null,null,"",null,null,null,null,{"$f":"IF( B29 > $D$10+14, SUMIFS($G$13:G29, $D$13:D29,\"Direct/Indirect/Clinical Administration\", $B$13:B29,\">\"&$D$10 + 14) + ((IF(SUMIF(Table1315187101322[Type of Care], \"QI\", Table1315187101322[Duration])>= 4, 4,IF(SUMIF(Table1315187101322[Type of Care], \"QI\", Table1315187101322[Duration])<= 3, SUMIF(Table1315187101322[Type of Care], \"QI\", Table1315187101322[Duration]), 0))))  > 90, SUMIFS($G$13:G29, $D$13:D29,\"Direct/Indirect/Clinical Administration\",  $B$13:B29,\"<=\"&$D$10 + 14)+ ((IF(SUMIF(Table1315187101322[Type of Care], \"QI\", Table1315187101322[Duration])>= 4, 4,IF(SUMIF(Table1315187101322[Type of Care], \"QI\", Table1315187101322[Duration])<= 3, SUMIF(Table1315187101322[Type of Care], \"QI\", Table1315187101322[Duration]), 0))))> 90)","v":false}]
[null,null,"",null,null,null,null,{"$f":"IF( B30 > $D$10+14, SUMIFS($G$13:G30, $D$13:D30,\"Direct/Indirect/Clinical Administration\", $B$13:B30,\">\"&$D$10 + 14) + ((IF(SUMIF(Table1315187101322[Type of Care], \"QI\", Table1315187101322[Duration])>= 4, 4,IF(SUMIF(Table1315187101322[Type of Care], \"QI\", Table1315187101322[Duration])<= 3, SUMIF(Table1315187101322[Type of Care], \"QI\", Table1315187101322[Duration]), 0))))  > 90, SUMIFS($G$13:G30, $D$13:D30,\"Direct/Indirect/Clinical Administration\",  $B$13:B30,\"<=\"&$D$10 + 14)+ ((IF(SUMIF(Table1315187101322[Type of Care], \"QI\", Table1315187101322[Duration])>= 4, 4,IF(SUMIF(Table1315187101322[Type of Care], \"QI\", Table1315187101322[Duration])<= 3, SUMIF(Table1315187101322[Type of Care], \"QI\", Table1315187101322[Duration]), 0))))> 90)","v":false}]
[null,null,"",null,null,null,null,{"$f":"IF( B31 > $D$10+14, SUMIFS($G$13:G31, $D$13:D31,\"Direct/Indirect/Clinical Administration\", $B$13:B31,\">\"&$D$10 + 14) + ((IF(SUMIF(Table1315187101322[Type of Care], \"QI\", Table1315187101322[Duration])>= 4, 4,IF(SUMIF(Table1315187101322[Type of Care], \"QI\", Table1315187101322[Duration])<= 3, SUMIF(Table1315187101322[Type of Care], \"QI\", Table1315187101322[Duration]), 0))))  > 90, SUMIFS($G$13:G31, $D$13:D31,\"Direct/Indirect/Clinical Administration\",  $B$13:B31,\"<=\"&$D$10 + 14)+ ((IF(SUMIF(Table1315187101322[Type of Care], \"QI\", Table1315187101322[Duration])>= 4, 4,IF(SUMIF(Table1315187101322[Type of Care], \"QI\", Table1315187101322[Duration])<= 3, SUMIF(Table1315187101322[Type of Care], \"QI\", Table1315187101322[Duration]), 0))))> 90)","v":false}]
[null,null,"",null,null,null,null,{"$f":"IF( B32 > $D$10+14, SUMIFS($G$13:G32, $D$13:D32,\"Direct/Indirect/Clinical Administration\", $B$13:B32,\">\"&$D$10 + 14) + ((IF(SUMIF(Table1315187101322[Type of Care], \"QI\", Table1315187101322[Duration])>= 4, 4,IF(SUMIF(Table1315187101322[Type of Care], \"QI\", Table1315187101322[Duration])<= 3, SUMIF(Table1315187101322[Type of Care], \"QI\", Table1315187101322[Duration]), 0))))  > 90, SUMIFS($G$13:G32, $D$13:D32,\"Direct/Indirect/Clinical Administration\",  $B$13:B32,\"<=\"&$D$10 + 14)+ ((IF(SUMIF(Table1315187101322[Type of Care], \"QI\", Table1315187101322[Duration])>= 4, 4,IF(SUMIF(Table1315187101322[Type of Care], \"QI\", Table1315187101322[Duration])<= 3, SUMIF(Table1315187101322[Type of Care], \"QI\", Table1315187101322[Duration]), 0))))> 90)","v":false}]
[null,null,"",null,null,null,null,{"$f":"IF( B33 > $D$10+14, SUMIFS($G$13:G33, $D$13:D33,\"Direct/Indirect/Clinical Administration\", $B$13:B33,\">\"&$D$10 + 14) + ((IF(SUMIF(Table1315187101322[Type of Care], \"QI\", Table1315187101322[Duration])>= 4, 4,IF(SUMIF(Table1315187101322[Type of Care], \"QI\", Table1315187101322[Duration])<= 3, SUMIF(Table1315187101322[Type of Care], \"QI\", Table1315187101322[Duration]), 0))))  > 90, SUMIFS($G$13:G33, $D$13:D33,\"Direct/Indirect/Clinical Administration\",  $B$13:B33,\"<=\"&$D$10 + 14)+ ((IF(SUMIF(Table1315187101322[Type of Care], \"QI\", Table1315187101322[Duration])>= 4, 4,IF(SUMIF(Table1315187101322[Type of Care], \"QI\", Table1315187101322[Duration])<= 3, SUMIF(Table1315187101322[Type of Care], \"QI\", Table1315187101322[Duration]), 0))))> 90)","v":false}]
[null,null,"",null,null,null,null,{"$f":"IF( B34 > $D$10+14, SUMIFS($G$13:G34, $D$13:D34,\"Direct/Indirect/Clinical Administration\", $B$13:B34,\">\"&$D$10 + 14) + ((IF(SUMIF(Table1315187101322[Type of Care], \"QI\", Table1315187101322[Duration])>= 4, 4,IF(SUMIF(Table1315187101322[Type of Care], \"QI\", Table1315187101322[Duration])<= 3, SUMIF(Table1315187101322[Type of Care], \"QI\", Table1315187101322[Duration]), 0))))  > 90, SUMIFS($G$13:G34, $D$13:D34,\"Direct/Indirect/Clinical Administration\",  $B$13:B34,\"<=\"&$D$10 + 14)+ ((IF(SUMIF(Table1315187101322[Type of Care], \"QI\", Table1315187101322[Duration])>= 4, 4,IF(SUMIF(Table1315187101322[Type of Care], \"QI\", Table1315187101322[Duration])<= 3, SUMIF(Table1315187101322[Type of Care], \"QI\", Table1315187101322[Duration]), 0))))> 90)","v":false}]
[null,null,{"$f":"IF(B35=\"\", \"\", B35)","v":""},null,null,"Total Contract Hours",{"$f":"(SUMIF(Table1315187101322[Type of Care], \"Direct/Indirect/Clinical Administration\",Table1315187101322[Duration]))","v":0},"CT1"]
[null,null,null,null,null,"Total Included QI Hours",{"$f":"(IF(SUMIF(Table1315187101322[Type of Care], \"QI\", Table1315187101322[Duration])>= 4, 4,IF(SUMIF(Table1315187101322[Type of Care], \"QI\", Table1315187101322[Duration])<= 3, SUMIF(Table1315187101322[Type of Care], \"QI\", Table1315187101322[Duration]), 0)))","v":0},"QI1"]
[null,null,null,null,null,"Total Excluded Hours",{"$f":"G38+G39","v":0},"EX1"]
[null,null,null,null,null,"         Excluded Contract Hours",{"$f":"(SUMIF(Table1315187101322[Type of Care], \"Third Party/Specialist FFS\",Table1315187101322[Duration])) + (SUMIF(Table1315187101322[Type of Care], \"Break (>15 Minutes)\", Table1315187101322[Duration]))","v":0},"EXC1"]
[null,null,null,null,null,"      Excluded QI Hours",{"$f":"(SUMIF(Table1315187101322[Type of Care], \"QI\", Table1315187101322[Duration]) - (IF(SUMIF(Table1315187101322[Type of Care], \"QI\", Table1315187101322[Duration])>= 4, 4,IF(SUMIF(Table1315187101322[Type of Care], \"QI\", Table1315187101322[Duration])<= 3, SUMIF(Table1315187101322[Type of Care], \"QI\", Table1315187101322[Duration]), 0))))","v":0},"EXQI1"]
[null,null,{"$f":"IF(B40=\"\", \"\", B40)","v":""},null,null,"Hours Above 90hr/semi-monthly",{"$f":"  (IF(SUMIFS(Table1315187101322[Duration],Table1315187101322[Date (YYYY-MM-DD)], \">\"&$D$10+14, Table1315187101322[Type of Care], \"Direct/Indirect/Clinical Administration\")>= 90, (SUMIFS(Table1315187101322[Duration],Table1315187101322[Date (YYYY-MM-DD)], \">\"&$D$10+14, Table1315187101322[Type of Care], \"Direct/Indirect/Clinical Administration\")+ (IF(SUMIF(Table1315187101322[Type of Care], \"QI\", Table1315187101322[Duration])>= 4, 4,IF(SUMIF(Table1315187101322[Type of Care], \"QI\", Table1315187101322[Duration])<= 3, SUMIF(Table1315187101322[Type of Care], \"QI\", Table1315187101322[Duration]), 0))) -90))) + (IF(SUMIFS(Table1315187101322[Duration],Table1315187101322[Date (YYYY-MM-DD)], \"<=\"&$D$10+14, Table1315187101322[Type of Care], \"Direct/Indirect/Clinical Administration\")>= 90, (SUMIFS(Table1315187101322[Duration],Table1315187101322[Date (YYYY-MM-DD)], \"<=\"&$D$10+14, Table1315187101322[Type of Care], \"Direct/Indirect/Clinical Administration\")+ (IF(SUMIF(Table1315187101322[Type of Care], \"QI\", Table1315187101322[Duration])>= 4, 4,IF(SUMIF(Table1315187101322[Type of Care], \"QI\", Table1315187101322[Duration])<= 3, SUMIF(Table1315187101322[Type of Care], \"QI\", Table1315187101322[Duration]), 0))) -90)))","v":0},"A901"]
[]
[]
[null,{"$f":"IF(Clinic!C5=\"Jan - Mar\", \"February\", IF(Clinic!C5= \"Apr - June\", \"May\", IF(Clinic!C5=\"July - Sept\", \"August\", IF(Clinic!C5=\" Oct - Dec\", \"November\"))))","v":"February"},{"$f":"Clinic!C6","v":2021},{"$f":"DATE(YEAR(B46),MONTH(DATEVALUE(B43&\"1\")),1)","v":"1900-02-01"},null,null,null,"Month2"]
[]
[null,"Date (YYYY-MM-DD)","Day ","Type of Care","Start Time AM/PM","End Time AM/PM","Duration","FALSE/TRUE"]
[null,null,{"$f":"IF(B46=\"\", \"\", B46)","v":""},null,null,null,null,{"$f":"IF( B46 > $D$43+14, SUMIFS($G$46:G46, $D$46:D46,\"Direct/Indirect/Clinical Administration\", $B$46:B46,\">\"&$D$43 + 14) + ((IF(SUMIF(Table13216198111423[Type of Care], \"QI\", Table13216198111423[Duration])>= 4, 4,IF(SUMIF(Table13216198111423[Type of Care], \"QI\", Table13216198111423[Duration])<= 3, SUMIF(Table13216198111423[Type of Care], \"QI\", Table13216198111423[Duration]), 0))))  > 90, SUMIFS($G$46:G46, $D$46:D46,\"Direct/Indirect/Clinical Administration\",  $B$46:B46,\"<=\"&$D$43 + 14)+ ((IF(SUMIF(Table13216198111423[Type of Care], \"QI\", Table13216198111423[Duration])>= 4, 4,IF(SUMIF(Table13216198111423[Type of Care], \"QI\", Table13216198111423[Duration])<= 3, SUMIF(Table13216198111423[Type of Care], \"QI\", Table13216198111423[Duration]), 0))))> 90)","v":false}]
[null,null,{"$f":"IF(B47=\"\", \"\", B47)","v":""},null,null,null,null,{"$f":"IF( B47 > $D$43+14, SUMIFS($G$46:G47, $D$46:D47,\"Direct/Indirect/Clinical Administration\", $B$46:B47,\">\"&$D$43 + 14) + ((IF(SUMIF(Table13216198111423[Type of Care], \"QI\", Table13216198111423[Duration])>= 4, 4,IF(SUMIF(Table13216198111423[Type of Care], \"QI\", Table13216198111423[Duration])<= 3, SUMIF(Table13216198111423[Type of Care], \"QI\", Table13216198111423[Duration]), 0))))  > 90, SUMIFS($G$46:G47, $D$46:D47,\"Direct/Indirect/Clinical Administration\",  $B$46:B47,\"<=\"&$D$43 + 14)+ ((IF(SUMIF(Table13216198111423[Type of Care], \"QI\", Table13216198111423[Duration])>= 4, 4,IF(SUMIF(Table13216198111423[Type of Care], \"QI\", Table13216198111423[Duration])<= 3, SUMIF(Table13216198111423[Type of Care], \"QI\", Table13216198111423[Duration]), 0))))> 90)","v":false}]
[null,null,"",null,null,null,null,{"$f":"IF( B48 > $D$43+14, SUMIFS($G$46:G48, $D$46:D48,\"Direct/Indirect/Clinical Administration\", $B$46:B48,\">\"&$D$43 + 14) + ((IF(SUMIF(Table13216198111423[Type of Care], \"QI\", Table13216198111423[Duration])>= 4, 4,IF(SUMIF(Table13216198111423[Type of Care], \"QI\", Table13216198111423[Duration])<= 3, SUMIF(Table13216198111423[Type of Care], \"QI\", Table13216198111423[Duration]), 0))))  > 90, SUMIFS($G$46:G48, $D$46:D48,\"Direct/Indirect/Clinical Administration\",  $B$46:B48,\"<=\"&$D$43 + 14)+ ((IF(SUMIF(Table13216198111423[Type of Care], \"QI\", Table13216198111423[Duration])>= 4, 4,IF(SUMIF(Table13216198111423[Type of Care], \"QI\", Table13216198111423[Duration])<= 3, SUMIF(Table13216198111423[Type of Care], \"QI\", Table13216198111423[Duration]), 0))))> 90)","v":false}]
[null,null,"",null,null,null,null,{"$f":"IF( B49 > $D$43+14, SUMIFS($G$46:G49, $D$46:D49,\"Direct/Indirect/Clinical Administration\", $B$46:B49,\">\"&$D$43 + 14) + ((IF(SUMIF(Table13216198111423[Type of Care], \"QI\", Table13216198111423[Duration])>= 4, 4,IF(SUMIF(Table13216198111423[Type of Care], \"QI\", Table13216198111423[Duration])<= 3, SUMIF(Table13216198111423[Type of Care], \"QI\", Table13216198111423[Duration]), 0))))  > 90, SUMIFS($G$46:G49, $D$46:D49,\"Direct/Indirect/Clinical Administration\",  $B$46:B49,\"<=\"&$D$43 + 14)+ ((IF(SUMIF(Table13216198111423[Type of Care], \"QI\", Table13216198111423[Duration])>= 4, 4,IF(SUMIF(Table13216198111423[Type of Care], \"QI\", Table13216198111423[Duration])<= 3, SUMIF(Table13216198111423[Type of Care], \"QI\", Table13216198111423[Duration]), 0))))> 90)","v":false}]
[null,null,"",null,null,null,null,{"$f":"IF( B50 > $D$43+14, SUMIFS($G$46:G50, $D$46:D50,\"Direct/Indirect/Clinical Administration\", $B$46:B50,\">\"&$D$43 + 14) + ((IF(SUMIF(Table13216198111423[Type of Care], \"QI\", Table13216198111423[Duration])>= 4, 4,IF(SUMIF(Table13216198111423[Type of Care], \"QI\", Table13216198111423[Duration])<= 3, SUMIF(Table13216198111423[Type of Care], \"QI\", Table13216198111423[Duration]), 0))))  > 90, SUMIFS($G$46:G50, $D$46:D50,\"Direct/Indirect/Clinical Administration\",  $B$46:B50,\"<=\"&$D$43 + 14)+ ((IF(SUMIF(Table13216198111423[Type of Care], \"QI\", Table13216198111423[Duration])>= 4, 4,IF(SUMIF(Table13216198111423[Type of Care], \"QI\", Table13216198111423[Duration])<= 3, SUMIF(Table13216198111423[Type of Care], \"QI\", Table13216198111423[Duration]), 0))))> 90)","v":false}]
[null,null,"",null,null,null,null,{"$f":"IF( B51 > $D$43+14, SUMIFS($G$46:G51, $D$46:D51,\"Direct/Indirect/Clinical Administration\", $B$46:B51,\">\"&$D$43 + 14) + ((IF(SUMIF(Table13216198111423[Type of Care], \"QI\", Table13216198111423[Duration])>= 4, 4,IF(SUMIF(Table13216198111423[Type of Care], \"QI\", Table13216198111423[Duration])<= 3, SUMIF(Table13216198111423[Type of Care], \"QI\", Table13216198111423[Duration]), 0))))  > 90, SUMIFS($G$46:G51, $D$46:D51,\"Direct/Indirect/Clinical Administration\",  $B$46:B51,\"<=\"&$D$43 + 14)+ ((IF(SUMIF(Table13216198111423[Type of Care], \"QI\", Table13216198111423[Duration])>= 4, 4,IF(SUMIF(Table13216198111423[Type of Care], \"QI\", Table13216198111423[Duration])<= 3, SUMIF(Table13216198111423[Type of Care], \"QI\", Table13216198111423[Duration]), 0))))> 90)","v":false}]
[null,null,"",null,null,null,null,{"$f":"IF( B52 > $D$43+14, SUMIFS($G$46:G52, $D$46:D52,\"Direct/Indirect/Clinical Administration\", $B$46:B52,\">\"&$D$43 + 14) + ((IF(SUMIF(Table13216198111423[Type of Care], \"QI\", Table13216198111423[Duration])>= 4, 4,IF(SUMIF(Table13216198111423[Type of Care], \"QI\", Table13216198111423[Duration])<= 3, SUMIF(Table13216198111423[Type of Care], \"QI\", Table13216198111423[Duration]), 0))))  > 90, SUMIFS($G$46:G52, $D$46:D52,\"Direct/Indirect/Clinical Administration\",  $B$46:B52,\"<=\"&$D$43 + 14)+ ((IF(SUMIF(Table13216198111423[Type of Care], \"QI\", Table13216198111423[Duration])>= 4, 4,IF(SUMIF(Table13216198111423[Type of Care], \"QI\", Table13216198111423[Duration])<= 3, SUMIF(Table13216198111423[Type of Care], \"QI\", Table13216198111423[Duration]), 0))))> 90)","v":false}]
[null,null,"",null,null,null,null,{"$f":"IF( B53 > $D$43+14, SUMIFS($G$46:G53, $D$46:D53,\"Direct/Indirect/Clinical Administration\", $B$46:B53,\">\"&$D$43 + 14) + ((IF(SUMIF(Table13216198111423[Type of Care], \"QI\", Table13216198111423[Duration])>= 4, 4,IF(SUMIF(Table13216198111423[Type of Care], \"QI\", Table13216198111423[Duration])<= 3, SUMIF(Table13216198111423[Type of Care], \"QI\", Table13216198111423[Duration]), 0))))  > 90, SUMIFS($G$46:G53, $D$46:D53,\"Direct/Indirect/Clinical Administration\",  $B$46:B53,\"<=\"&$D$43 + 14)+ ((IF(SUMIF(Table13216198111423[Type of Care], \"QI\", Table13216198111423[Duration])>= 4, 4,IF(SUMIF(Table13216198111423[Type of Care], \"QI\", Table13216198111423[Duration])<= 3, SUMIF(Table13216198111423[Type of Care], \"QI\", Table13216198111423[Duration]), 0))))> 90)","v":false}]
[null,null,"",null,null,null,null,{"$f":"IF( B54 > $D$43+14, SUMIFS($G$46:G54, $D$46:D54,\"Direct/Indirect/Clinical Administration\", $B$46:B54,\">\"&$D$43 + 14) + ((IF(SUMIF(Table13216198111423[Type of Care], \"QI\", Table13216198111423[Duration])>= 4, 4,IF(SUMIF(Table13216198111423[Type of Care], \"QI\", Table13216198111423[Duration])<= 3, SUMIF(Table13216198111423[Type of Care], \"QI\", Table13216198111423[Duration]), 0))))  > 90, SUMIFS($G$46:G54, $D$46:D54,\"Direct/Indirect/Clinical Administration\",  $B$46:B54,\"<=\"&$D$43 + 14)+ ((IF(SUMIF(Table13216198111423[Type of Care], \"QI\", Table13216198111423[Duration])>= 4, 4,IF(SUMIF(Table13216198111423[Type of Care], \"QI\", Table13216198111423[Duration])<= 3, SUMIF(Table13216198111423[Type of Care], \"QI\", Table13216198111423[Duration]), 0))))> 90)","v":false}]
[null,null,"",null,null,null,null,{"$f":"IF( B55 > $D$43+14, SUMIFS($G$46:G55, $D$46:D55,\"Direct/Indirect/Clinical Administration\", $B$46:B55,\">\"&$D$43 + 14) + ((IF(SUMIF(Table13216198111423[Type of Care], \"QI\", Table13216198111423[Duration])>= 4, 4,IF(SUMIF(Table13216198111423[Type of Care], \"QI\", Table13216198111423[Duration])<= 3, SUMIF(Table13216198111423[Type of Care], \"QI\", Table13216198111423[Duration]), 0))))  > 90, SUMIFS($G$46:G55, $D$46:D55,\"Direct/Indirect/Clinical Administration\",  $B$46:B55,\"<=\"&$D$43 + 14)+ ((IF(SUMIF(Table13216198111423[Type of Care], \"QI\", Table13216198111423[Duration])>= 4, 4,IF(SUMIF(Table13216198111423[Type of Care], \"QI\", Table13216198111423[Duration])<= 3, SUMIF(Table13216198111423[Type of Care], \"QI\", Table13216198111423[Duration]), 0))))> 90)","v":false}]
[null,null,"",null,null,null,null,{"$f":"IF( B56 > $D$43+14, SUMIFS($G$46:G56, $D$46:D56,\"Direct/Indirect/Clinical Administration\", $B$46:B56,\">\"&$D$43 + 14) + ((IF(SUMIF(Table13216198111423[Type of Care], \"QI\", Table13216198111423[Duration])>= 4, 4,IF(SUMIF(Table13216198111423[Type of Care], \"QI\", Table13216198111423[Duration])<= 3, SUMIF(Table13216198111423[Type of Care], \"QI\", Table13216198111423[Duration]), 0))))  > 90, SUMIFS($G$46:G56, $D$46:D56,\"Direct/Indirect/Clinical Administration\",  $B$46:B56,\"<=\"&$D$43 + 14)+ ((IF(SUMIF(Table13216198111423[Type of Care], \"QI\", Table13216198111423[Duration])>= 4, 4,IF(SUMIF(Table13216198111423[Type of Care], \"QI\", Table13216198111423[Duration])<= 3, SUMIF(Table13216198111423[Type of Care], \"QI\", Table13216198111423[Duration]), 0))))> 90)","v":false}]
[null,null,"",null,null,null,null,{"$f":"IF( B57 > $D$43+14, SUMIFS($G$46:G57, $D$46:D57,\"Direct/Indirect/Clinical Administration\", $B$46:B57,\">\"&$D$43 + 14) + ((IF(SUMIF(Table13216198111423[Type of Care], \"QI\", Table13216198111423[Duration])>= 4, 4,IF(SUMIF(Table13216198111423[Type of Care], \"QI\", Table13216198111423[Duration])<= 3, SUMIF(Table13216198111423[Type of Care], \"QI\", Table13216198111423[Duration]), 0))))  > 90, SUMIFS($G$46:G57, $D$46:D57,\"Direct/Indirect/Clinical Administration\",  $B$46:B57,\"<=\"&$D$43 + 14)+ ((IF(SUMIF(Table13216198111423[Type of Care], \"QI\", Table13216198111423[Duration])>= 4, 4,IF(SUMIF(Table13216198111423[Type of Care], \"QI\", Table13216198111423[Duration])<= 3, SUMIF(Table13216198111423[Type of Care], \"QI\", Table13216198111423[Duration]), 0))))> 90)","v":false}]
[null,null,"",null,null,null,null,{"$f":"IF( B58 > $D$43+14, SUMIFS($G$46:G58, $D$46:D58,\"Direct/Indirect/Clinical Administration\", $B$46:B58,\">\"&$D$43 + 14) + ((IF(SUMIF(Table13216198111423[Type of Care], \"QI\", Table13216198111423[Duration])>= 4, 4,IF(SUMIF(Table13216198111423[Type of Care], \"QI\", Table13216198111423[Duration])<= 3, SUMIF(Table13216198111423[Type of Care], \"QI\", Table13216198111423[Duration]), 0))))  > 90, SUMIFS($G$46:G58, $D$46:D58,\"Direct/Indirect/Clinical Administration\",  $B$46:B58,\"<=\"&$D$43 + 14)+ ((IF(SUMIF(Table13216198111423[Type of Care], \"QI\", Table13216198111423[Duration])>= 4, 4,IF(SUMIF(Table13216198111423[Type of Care], \"QI\", Table13216198111423[Duration])<= 3, SUMIF(Table13216198111423[Type of Care], \"QI\", Table13216198111423[Duration]), 0))))> 90)","v":false}]
[null,null,"",null,null,null,null,{"$f":"IF( B59 > $D$43+14, SUMIFS($G$46:G59, $D$46:D59,\"Direct/Indirect/Clinical Administration\", $B$46:B59,\">\"&$D$43 + 14) + ((IF(SUMIF(Table13216198111423[Type of Care], \"QI\", Table13216198111423[Duration])>= 4, 4,IF(SUMIF(Table13216198111423[Type of Care], \"QI\", Table13216198111423[Duration])<= 3, SUMIF(Table13216198111423[Type of Care], \"QI\", Table13216198111423[Duration]), 0))))  > 90, SUMIFS($G$46:G59, $D$46:D59,\"Direct/Indirect/Clinical Administration\",  $B$46:B59,\"<=\"&$D$43 + 14)+ ((IF(SUMIF(Table13216198111423[Type of Care], \"QI\", Table13216198111423[Duration])>= 4, 4,IF(SUMIF(Table13216198111423[Type of Care], \"QI\", Table13216198111423[Duration])<= 3, SUMIF(Table13216198111423[Type of Care], \"QI\", Table13216198111423[Duration]), 0))))> 90)","v":false}]
[null,null,"",null,null,null,null,{"$f":"IF( B60 > $D$43+14, SUMIFS($G$46:G60, $D$46:D60,\"Direct/Indirect/Clinical Administration\", $B$46:B60,\">\"&$D$43 + 14) + ((IF(SUMIF(Table13216198111423[Type of Care], \"QI\", Table13216198111423[Duration])>= 4, 4,IF(SUMIF(Table13216198111423[Type of Care], \"QI\", Table13216198111423[Duration])<= 3, SUMIF(Table13216198111423[Type of Care], \"QI\", Table13216198111423[Duration]), 0))))  > 90, SUMIFS($G$46:G60, $D$46:D60,\"Direct/Indirect/Clinical Administration\",  $B$46:B60,\"<=\"&$D$43 + 14)+ ((IF(SUMIF(Table13216198111423[Type of Care], \"QI\", Table13216198111423[Duration])>= 4, 4,IF(SUMIF(Table13216198111423[Type of Care], \"QI\", Table13216198111423[Duration])<= 3, SUMIF(Table13216198111423[Type of Care], \"QI\", Table13216198111423[Duration]), 0))))> 90)","v":false}]
[null,null,"",null,null,null,null,{"$f":"IF( B61 > $D$43+14, SUMIFS($G$46:G61, $D$46:D61,\"Direct/Indirect/Clinical Administration\", $B$46:B61,\">\"&$D$43 + 14) + ((IF(SUMIF(Table13216198111423[Type of Care], \"QI\", Table13216198111423[Duration])>= 4, 4,IF(SUMIF(Table13216198111423[Type of Care], \"QI\", Table13216198111423[Duration])<= 3, SUMIF(Table13216198111423[Type of Care], \"QI\", Table13216198111423[Duration]), 0))))  > 90, SUMIFS($G$46:G61, $D$46:D61,\"Direct/Indirect/Clinical Administration\",  $B$46:B61,\"<=\"&$D$43 + 14)+ ((IF(SUMIF(Table13216198111423[Type of Care], \"QI\", Table13216198111423[Duration])>= 4, 4,IF(SUMIF(Table13216198111423[Type of Care], \"QI\", Table13216198111423[Duration])<= 3, SUMIF(Table13216198111423[Type of Care], \"QI\", Table13216198111423[Duration]), 0))))> 90)","v":false}]
[null,null,"",null,null,null,null,{"$f":"IF( B62 > $D$43+14, SUMIFS($G$46:G62, $D$46:D62,\"Direct/Indirect/Clinical Administration\", $B$46:B62,\">\"&$D$43 + 14) + ((IF(SUMIF(Table13216198111423[Type of Care], \"QI\", Table13216198111423[Duration])>= 4, 4,IF(SUMIF(Table13216198111423[Type of Care], \"QI\", Table13216198111423[Duration])<= 3, SUMIF(Table13216198111423[Type of Care], \"QI\", Table13216198111423[Duration]), 0))))  > 90, SUMIFS($G$46:G62, $D$46:D62,\"Direct/Indirect/Clinical Administration\",  $B$46:B62,\"<=\"&$D$43 + 14)+ ((IF(SUMIF(Table13216198111423[Type of Care], \"QI\", Table13216198111423[Duration])>= 4, 4,IF(SUMIF(Table13216198111423[Type of Care], \"QI\", Table13216198111423[Duration])<= 3, SUMIF(Table13216198111423[Type of Care], \"QI\", Table13216198111423[Duration]), 0))))> 90)","v":false}]
[null,null,"",null,null,null,null,{"$f":"IF( B63 > $D$43+14, SUMIFS($G$46:G63, $D$46:D63,\"Direct/Indirect/Clinical Administration\", $B$46:B63,\">\"&$D$43 + 14) + ((IF(SUMIF(Table13216198111423[Type of Care], \"QI\", Table13216198111423[Duration])>= 4, 4,IF(SUMIF(Table13216198111423[Type of Care], \"QI\", Table13216198111423[Duration])<= 3, SUMIF(Table13216198111423[Type of Care], \"QI\", Table13216198111423[Duration]), 0))))  > 90, SUMIFS($G$46:G63, $D$46:D63,\"Direct/Indirect/Clinical Administration\",  $B$46:B63,\"<=\"&$D$43 + 14)+ ((IF(SUMIF(Table13216198111423[Type of Care], \"QI\", Table13216198111423[Duration])>= 4, 4,IF(SUMIF(Table13216198111423[Type of Care], \"QI\", Table13216198111423[Duration])<= 3, SUMIF(Table13216198111423[Type of Care], \"QI\", Table13216198111423[Duration]), 0))))> 90)","v":false}]
[null,null,"",null,null,null,null,{"$f":"IF( B64 > $D$43+14, SUMIFS($G$46:G64, $D$46:D64,\"Direct/Indirect/Clinical Administration\", $B$46:B64,\">\"&$D$43 + 14) + ((IF(SUMIF(Table13216198111423[Type of Care], \"QI\", Table13216198111423[Duration])>= 4, 4,IF(SUMIF(Table13216198111423[Type of Care], \"QI\", Table13216198111423[Duration])<= 3, SUMIF(Table13216198111423[Type of Care], \"QI\", Table13216198111423[Duration]), 0))))  > 90, SUMIFS($G$46:G64, $D$46:D64,\"Direct/Indirect/Clinical Administration\",  $B$46:B64,\"<=\"&$D$43 + 14)+ ((IF(SUMIF(Table13216198111423[Type of Care], \"QI\", Table13216198111423[Duration])>= 4, 4,IF(SUMIF(Table13216198111423[Type of Care], \"QI\", Table13216198111423[Duration])<= 3, SUMIF(Table13216198111423[Type of Care], \"QI\", Table13216198111423[Duration]), 0))))> 90)","v":false}]
[null,null,"",null,null,null,null,{"$f":"IF( B65 > $D$43+14, SUMIFS($G$46:G65, $D$46:D65,\"Direct/Indirect/Clinical Administration\", $B$46:B65,\">\"&$D$43 + 14) + ((IF(SUMIF(Table13216198111423[Type of Care], \"QI\", Table13216198111423[Duration])>= 4, 4,IF(SUMIF(Table13216198111423[Type of Care], \"QI\", Table13216198111423[Duration])<= 3, SUMIF(Table13216198111423[Type of Care], \"QI\", Table13216198111423[Duration]), 0))))  > 90, SUMIFS($G$46:G65, $D$46:D65,\"Direct/Indirect/Clinical Administration\",  $B$46:B65,\"<=\"&$D$43 + 14)+ ((IF(SUMIF(Table13216198111423[Type of Care], \"QI\", Table13216198111423[Duration])>= 4, 4,IF(SUMIF(Table13216198111423[Type of Care], \"QI\", Table13216198111423[Duration])<= 3, SUMIF(Table13216198111423[Type of Care], \"QI\", Table13216198111423[Duration]), 0))))> 90)","v":false}]
[null,null,"",null,null,null,null,{"$f":"IF( B66 > $D$43+14, SUMIFS($G$46:G66, $D$46:D66,\"Direct/Indirect/Clinical Administration\", $B$46:B66,\">\"&$D$43 + 14) + ((IF(SUMIF(Table13216198111423[Type of Care], \"QI\", Table13216198111423[Duration])>= 4, 4,IF(SUMIF(Table13216198111423[Type of Care], \"QI\", Table13216198111423[Duration])<= 3, SUMIF(Table13216198111423[Type of Care], \"QI\", Table13216198111423[Duration]), 0))))  > 90, SUMIFS($G$46:G66, $D$46:D66,\"Direct/Indirect/Clinical Administration\",  $B$46:B66,\"<=\"&$D$43 + 14)+ ((IF(SUMIF(Table13216198111423[Type of Care], \"QI\", Table13216198111423[Duration])>= 4, 4,IF(SUMIF(Table13216198111423[Type of Care], \"QI\", Table13216198111423[Duration])<= 3, SUMIF(Table13216198111423[Type of Care], \"QI\", Table13216198111423[Duration]), 0))))> 90)","v":false}]
[null,null,"",null,null,null,null,{"$f":"IF( B67 > $D$43+14, SUMIFS($G$46:G67, $D$46:D67,\"Direct/Indirect/Clinical Administration\", $B$46:B67,\">\"&$D$43 + 14) + ((IF(SUMIF(Table13216198111423[Type of Care], \"QI\", Table13216198111423[Duration])>= 4, 4,IF(SUMIF(Table13216198111423[Type of Care], \"QI\", Table13216198111423[Duration])<= 3, SUMIF(Table13216198111423[Type of Care], \"QI\", Table13216198111423[Duration]), 0))))  > 90, SUMIFS($G$46:G67, $D$46:D67,\"Direct/Indirect/Clinical Administration\",  $B$46:B67,\"<=\"&$D$43 + 14)+ ((IF(SUMIF(Table13216198111423[Type of Care], \"QI\", Table13216198111423[Duration])>= 4, 4,IF(SUMIF(Table13216198111423[Type of Care], \"QI\", Table13216198111423[Duration])<= 3, SUMIF(Table13216198111423[Type of Care], \"QI\", Table13216198111423[Duration]), 0))))> 90)","v":false}]
[null,null,"",null,null,null,null,{"$f":"IF( B68 > $D$43+14, SUMIFS($G$46:G68, $D$46:D68,\"Direct/Indirect/Clinical Administration\", $B$46:B68,\">\"&$D$43 + 14) + ((IF(SUMIF(Table13216198111423[Type of Care], \"QI\", Table13216198111423[Duration])>= 4, 4,IF(SUMIF(Table13216198111423[Type of Care], \"QI\", Table13216198111423[Duration])<= 3, SUMIF(Table13216198111423[Type of Care], \"QI\", Table13216198111423[Duration]), 0))))  > 90, SUMIFS($G$46:G68, $D$46:D68,\"Direct/Indirect/Clinical Administration\",  $B$46:B68,\"<=\"&$D$43 + 14)+ ((IF(SUMIF(Table13216198111423[Type of Care], \"QI\", Table13216198111423[Duration])>= 4, 4,IF(SUMIF(Table13216198111423[Type of Care], \"QI\", Table13216198111423[Duration])<= 3, SUMIF(Table13216198111423[Type of Care], \"QI\", Table13216198111423[Duration]), 0))))> 90)","v":false}]
[null,null,"",null,null,null,null,{"$f":"IF( B69 > $D$43+14, SUMIFS($G$46:G69, $D$46:D69,\"Direct/Indirect/Clinical Administration\", $B$46:B69,\">\"&$D$43 + 14) + ((IF(SUMIF(Table13216198111423[Type of Care], \"QI\", Table13216198111423[Duration])>= 4, 4,IF(SUMIF(Table13216198111423[Type of Care], \"QI\", Table13216198111423[Duration])<= 3, SUMIF(Table13216198111423[Type of Care], \"QI\", Table13216198111423[Duration]), 0))))  > 90, SUMIFS($G$46:G69, $D$46:D69,\"Direct/Indirect/Clinical Administration\",  $B$46:B69,\"<=\"&$D$43 + 14)+ ((IF(SUMIF(Table13216198111423[Type of Care], \"QI\", Table13216198111423[Duration])>= 4, 4,IF(SUMIF(Table13216198111423[Type of Care], \"QI\", Table13216198111423[Duration])<= 3, SUMIF(Table13216198111423[Type of Care], \"QI\", Table13216198111423[Duration]), 0))))> 90)","v":false}]
[null,null,"",null,null,null,null,{"$f":"IF( B70 > $D$43+14, SUMIFS($G$46:G70, $D$46:D70,\"Direct/Indirect/Clinical Administration\", $B$46:B70,\">\"&$D$43 + 14) + ((IF(SUMIF(Table13216198111423[Type of Care], \"QI\", Table13216198111423[Duration])>= 4, 4,IF(SUMIF(Table13216198111423[Type of Care], \"QI\", Table13216198111423[Duration])<= 3, SUMIF(Table13216198111423[Type of Care], \"QI\", Table13216198111423[Duration]), 0))))  > 90, SUMIFS($G$46:G70, $D$46:D70,\"Direct/Indirect/Clinical Administration\",  $B$46:B70,\"<=\"&$D$43 + 14)+ ((IF(SUMIF(Table13216198111423[Type of Care], \"QI\", Table13216198111423[Duration])>= 4, 4,IF(SUMIF(Table13216198111423[Type of Care], \"QI\", Table13216198111423[Duration])<= 3, SUMIF(Table13216198111423[Type of Care], \"QI\", Table13216198111423[Duration]), 0))))> 90)","v":false}]
[null,null,"",null,null,null,null,{"$f":"IF( B71 > $D$43+14, SUMIFS($G$46:G71, $D$46:D71,\"Direct/Indirect/Clinical Administration\", $B$46:B71,\">\"&$D$43 + 14) + ((IF(SUMIF(Table13216198111423[Type of Care], \"QI\", Table13216198111423[Duration])>= 4, 4,IF(SUMIF(Table13216198111423[Type of Care], \"QI\", Table13216198111423[Duration])<= 3, SUMIF(Table13216198111423[Type of Care], \"QI\", Table13216198111423[Duration]), 0))))  > 90, SUMIFS($G$46:G71, $D$46:D71,\"Direct/Indirect/Clinical Administration\",  $B$46:B71,\"<=\"&$D$43 + 14)+ ((IF(SUMIF(Table13216198111423[Type of Care], \"QI\", Table13216198111423[Duration])>= 4, 4,IF(SUMIF(Table13216198111423[Type of Care], \"QI\", Table13216198111423[Duration])<= 3, SUMIF(Table13216198111423[Type of Care], \"QI\", Table13216198111423[Duration]), 0))))> 90)","v":false}]
[null,null,"",null,null,null,null,{"$f":"IF( B72 > $D$43+14, SUMIFS($G$46:G72, $D$46:D72,\"Direct/Indirect/Clinical Administration\", $B$46:B72,\">\"&$D$43 + 14) + ((IF(SUMIF(Table13216198111423[Type of Care], \"QI\", Table13216198111423[Duration])>= 4, 4,IF(SUMIF(Table13216198111423[Type of Care], \"QI\", Table13216198111423[Duration])<= 3, SUMIF(Table13216198111423[Type of Care], \"QI\", Table13216198111423[Duration]), 0))))  > 90, SUMIFS($G$46:G72, $D$46:D72,\"Direct/Indirect/Clinical Administration\",  $B$46:B72,\"<=\"&$D$43 + 14)+ ((IF(SUMIF(Table13216198111423[Type of Care], \"QI\", Table13216198111423[Duration])>= 4, 4,IF(SUMIF(Table13216198111423[Type of Care], \"QI\", Table13216198111423[Duration])<= 3, SUMIF(Table13216198111423[Type of Care], \"QI\", Table13216198111423[Duration]), 0))))> 90)","v":false}]
[null,null,{"$f":"IF(B73=\"\", \"\", B73)","v":""},null,null,null,null,{"$f":"IF( B73 > $D$43+14, SUMIFS($G$46:G73, $D$46:D73,\"Direct/Indirect/Clinical Administration\", $B$46:B73,\">\"&$D$43 + 14) + ((IF(SUMIF(Table13216198111423[Type of Care], \"QI\", Table13216198111423[Duration])>= 4, 4,IF(SUMIF(Table13216198111423[Type of Care], \"QI\", Table13216198111423[Duration])<= 3, SUMIF(Table13216198111423[Type of Care], \"QI\", Table13216198111423[Duration]), 0))))  > 90, SUMIFS($G$46:G73, $D$46:D73,\"Direct/Indirect/Clinical Administration\",  $B$46:B73,\"<=\"&$D$43 + 14)+ ((IF(SUMIF(Table13216198111423[Type of Care], \"QI\", Table13216198111423[Duration])>= 4, 4,IF(SUMIF(Table13216198111423[Type of Care], \"QI\", Table13216198111423[Duration])<= 3, SUMIF(Table13216198111423[Type of Care], \"QI\", Table13216198111423[Duration]), 0))))> 90)","v":false}]
[null,null,"",null,null,null,null,{"$f":"IF( B74 > $D$43+14, SUMIFS($G$46:G74, $D$46:D74,\"Direct/Indirect/Clinical Administration\", $B$46:B74,\">\"&$D$43 + 14) + ((IF(SUMIF(Table13216198111423[Type of Care], \"QI\", Table13216198111423[Duration])>= 4, 4,IF(SUMIF(Table13216198111423[Type of Care], \"QI\", Table13216198111423[Duration])<= 3, SUMIF(Table13216198111423[Type of Care], \"QI\", Table13216198111423[Duration]), 0))))  > 90, SUMIFS($G$46:G74, $D$46:D74,\"Direct/Indirect/Clinical Administration\",  $B$46:B74,\"<=\"&$D$43 + 14)+ ((IF(SUMIF(Table13216198111423[Type of Care], \"QI\", Table13216198111423[Duration])>= 4, 4,IF(SUMIF(Table13216198111423[Type of Care], \"QI\", Table13216198111423[Duration])<= 3, SUMIF(Table13216198111423[Type of Care], \"QI\", Table13216198111423[Duration]), 0))))> 90)","v":false}]
[null,null,{"$f":"IF(B75=\"\", \"\", B75)","v":""},null,null,"Total Contract Hours",{"$f":"(SUMIF(Table13216198111423[Type of Care], \"Direct/Indirect/Clinical Administration\",Table13216198111423[Duration])) + (SUMIF(Table13216198111423[Type of Care], \"Correction Hours\",Table13216198111423[Duration]))","v":0},"CT2"]
[null,null,null,null,null,"Total Included QI Hours",{"$f":"(IF(SUMIF(Table13216198111423[Type of Care], \"QI\", Table13216198111423[Duration])>= 4, 4,IF(SUMIF(Table13216198111423[Type of Care], \"QI\", Table13216198111423[Duration])<= 3, SUMIF(Table13216198111423[Type of Care], \"QI\", Table13216198111423[Duration]), 0)))","v":0},"QI2"]
[null,null,null,null,null,"Total Excluded Hours",{"$f":"G78+G79","v":0},"EX2"]
[null,null,null,null,null,"         Excluded Contract Hours",{"$f":"(SUMIF(Table13216198111423[Type of Care], \"Third Party/Specialist FFS\",Table13216198111423[Duration])) + (SUMIF(Table13216198111423[Type of Care], \"Break (>15 Minutes)\", Table13216198111423[Duration]))","v":0},"EXC2"]
[null,null,null,null,null,"      Excluded QI Hours",{"$f":"(SUMIF(Table13216198111423[Type of Care], \"QI\", Table13216198111423[Duration]) - (IF(SUMIF(Table13216198111423[Type of Care], \"QI\", Table13216198111423[Duration])>= 4, 4,IF(SUMIF(Table13216198111423[Type of Care], \"QI\", Table13216198111423[Duration])<= 3, SUMIF(Table13216198111423[Type of Care], \"QI\", Table13216198111423[Duration]), 0))))","v":0},"EXQI2"]
[null,null,{"$f":"IF(B80=\"\", \"\", B80)","v":""},null,null,"Hours Above 90hr/semi-monthly",{"$f":"  (IF(SUMIFS(Table13216198111423[Duration],Table13216198111423[Date (YYYY-MM-DD)], \">\"&$D$43+14, Table13216198111423[Type of Care], \"Direct/Indirect/Clinical Administration\")>= 90, (SUMIFS(Table13216198111423[Duration],Table13216198111423[Date (YYYY-MM-DD)], \">\"&$D$43+14, Table13216198111423[Type of Care], \"Direct/Indirect/Clinical Administration\")+ (IF(SUMIF(Table13216198111423[Type of Care], \"QI\", Table13216198111423[Duration])>= 4, 4,IF(SUMIF(Table13216198111423[Type of Care], \"QI\", Table13216198111423[Duration])<= 3, SUMIF(Table13216198111423[Type of Care], \"QI\", Table13216198111423[Duration]), 0))) -90))) + (IF(SUMIFS(Table13216198111423[Duration],Table13216198111423[Date (YYYY-MM-DD)], \"<=\"&$D$43+14, Table13216198111423[Type of Care], \"Direct/Indirect/Clinical Administration\")>= 90, (SUMIFS(Table13216198111423[Duration],Table13216198111423[Date (YYYY-MM-DD)], \"<=\"&$D$43+14, Table13216198111423[Type of Care], \"Direct/Indirect/Clinical Administration\")+ (IF(SUMIF(Table13216198111423[Type of Care], \"QI\", Table13216198111423[Duration])>= 4, 4,IF(SUMIF(Table13216198111423[Type of Care], \"QI\", Table13216198111423[Duration])<= 3, SUMIF(Table13216198111423[Type of Care], \"QI\", Table13216198111423[Duration]), 0))) -90)))","v":0},"A902"]
[]
[]
[null,{"$f":"IF(Clinic!C5=\"Jan - Mar\", \"March\", IF(Clinic!C5= \"Apr - June\", \"June\", IF(Clinic!C5=\"July - Sept\", \"September\", IF(Clinic!C5=\" Oct - Dec\", \"December\"))))","v":"March"},{"$f":"Clinic!C6","v":2021},{"$f":"DATE(YEAR(B86),MONTH(DATEVALUE(B83&\"1\")),1)","v":"1900-03-01"},null,null,null,"Month3"]
[]
[null,"Date (YYYY-MM-DD)","Day ","Type of Care","Start Time AM/PM","End Time AM/PM","Duration ","FALSE/TRUE"]
[null,null,{"$f":"IF(B86=\"\", \"\", B86)","v":""},null,null,null,null,{"$f":"IF( B86 > $D$83+14, SUMIFS($G$86:G86, $D$86:D86,\"Direct/Indirect/Clinical Administration\", $B$86:B86,\">\"&$D$83 + 14) + ((IF(SUMIF(Table132617209122124[Type of Care], \"QI\", Table132617209122124[[Duration ]])>= 4, 4,IF(SUMIF(Table132617209122124[Type of Care], \"QI\", Table132617209122124[[Duration ]])<= 3, SUMIF(Table132617209122124[Type of Care], \"QI\", Table132617209122124[[Duration ]]), 0))))  > 90, SUMIFS($G$86:G86, $D$86:D86,\"Direct/Indirect/Clinical Administration\",  $B$86:B86,\"<=\"&$D$83 + 14)+ ((IF(SUMIF(Table132617209122124[Type of Care], \"QI\", Table132617209122124[[Duration ]])>= 4, 4,IF(SUMIF(Table132617209122124[Type of Care], \"QI\", Table132617209122124[[Duration ]])<= 3, SUMIF(Table132617209122124[Type of Care], \"QI\", Table132617209122124[[Duration ]]), 0))))> 90)","v":false}]
[null,null,{"$f":"IF(B87=\"\", \"\", B87)","v":""},null,null,null,null,{"$f":"IF( B87 > $D$83+14, SUMIFS($G$86:G87, $D$86:D87,\"Direct/Indirect/Clinical Administration\", $B$86:B87,\">\"&$D$83 + 14) + ((IF(SUMIF(Table132617209122124[Type of Care], \"QI\", Table132617209122124[[Duration ]])>= 4, 4,IF(SUMIF(Table132617209122124[Type of Care], \"QI\", Table132617209122124[[Duration ]])<= 3, SUMIF(Table132617209122124[Type of Care], \"QI\", Table132617209122124[[Duration ]]), 0))))  > 90, SUMIFS($G$86:G87, $D$86:D87,\"Direct/Indirect/Clinical Administration\",  $B$86:B87,\"<=\"&$D$83 + 14)+ ((IF(SUMIF(Table132617209122124[Type of Care], \"QI\", Table132617209122124[[Duration ]])>= 4, 4,IF(SUMIF(Table132617209122124[Type of Care], \"QI\", Table132617209122124[[Duration ]])<= 3, SUMIF(Table132617209122124[Type of Care], \"QI\", Table132617209122124[[Duration ]]), 0))))> 90)","v":false}]
[null,null,"",null,null,null,null,{"$f":"IF( B88 > $D$83+14, SUMIFS($G$86:G88, $D$86:D88,\"Direct/Indirect/Clinical Administration\", $B$86:B88,\">\"&$D$83 + 14) + ((IF(SUMIF(Table132617209122124[Type of Care], \"QI\", Table132617209122124[[Duration ]])>= 4, 4,IF(SUMIF(Table132617209122124[Type of Care], \"QI\", Table132617209122124[[Duration ]])<= 3, SUMIF(Table132617209122124[Type of Care], \"QI\", Table132617209122124[[Duration ]]), 0))))  > 90, SUMIFS($G$86:G88, $D$86:D88,\"Direct/Indirect/Clinical Administration\",  $B$86:B88,\"<=\"&$D$83 + 14)+ ((IF(SUMIF(Table132617209122124[Type of Care], \"QI\", Table132617209122124[[Duration ]])>= 4, 4,IF(SUMIF(Table132617209122124[Type of Care], \"QI\", Table132617209122124[[Duration ]])<= 3, SUMIF(Table132617209122124[Type of Care], \"QI\", Table132617209122124[[Duration ]]), 0))))> 90)","v":false}]
[null,null,"",null,null,null,null,{"$f":"IF( B89 > $D$83+14, SUMIFS($G$86:G89, $D$86:D89,\"Direct/Indirect/Clinical Administration\", $B$86:B89,\">\"&$D$83 + 14) + ((IF(SUMIF(Table132617209122124[Type of Care], \"QI\", Table132617209122124[[Duration ]])>= 4, 4,IF(SUMIF(Table132617209122124[Type of Care], \"QI\", Table132617209122124[[Duration ]])<= 3, SUMIF(Table132617209122124[Type of Care], \"QI\", Table132617209122124[[Duration ]]), 0))))  > 90, SUMIFS($G$86:G89, $D$86:D89,\"Direct/Indirect/Clinical Administration\",  $B$86:B89,\"<=\"&$D$83 + 14)+ ((IF(SUMIF(Table132617209122124[Type of Care], \"QI\", Table132617209122124[[Duration ]])>= 4, 4,IF(SUMIF(Table132617209122124[Type of Care], \"QI\", Table132617209122124[[Duration ]])<= 3, SUMIF(Table132617209122124[Type of Care], \"QI\", Table132617209122124[[Duration ]]), 0))))> 90)","v":false}]
[null,null,"",null,null,null,null,{"$f":"IF( B90 > $D$83+14, SUMIFS($G$86:G90, $D$86:D90,\"Direct/Indirect/Clinical Administration\", $B$86:B90,\">\"&$D$83 + 14) + ((IF(SUMIF(Table132617209122124[Type of Care], \"QI\", Table132617209122124[[Duration ]])>= 4, 4,IF(SUMIF(Table132617209122124[Type of Care], \"QI\", Table132617209122124[[Duration ]])<= 3, SUMIF(Table132617209122124[Type of Care], \"QI\", Table132617209122124[[Duration ]]), 0))))  > 90, SUMIFS($G$86:G90, $D$86:D90,\"Direct/Indirect/Clinical Administration\",  $B$86:B90,\"<=\"&$D$83 + 14)+ ((IF(SUMIF(Table132617209122124[Type of Care], \"QI\", Table132617209122124[[Duration ]])>= 4, 4,IF(SUMIF(Table132617209122124[Type of Care], \"QI\", Table132617209122124[[Duration ]])<= 3, SUMIF(Table132617209122124[Type of Care], \"QI\", Table132617209122124[[Duration ]]), 0))))> 90)","v":false}]
[null,null,"",null,null,null,null,{"$f":"IF( B91 > $D$83+14, SUMIFS($G$86:G91, $D$86:D91,\"Direct/Indirect/Clinical Administration\", $B$86:B91,\">\"&$D$83 + 14) + ((IF(SUMIF(Table132617209122124[Type of Care], \"QI\", Table132617209122124[[Duration ]])>= 4, 4,IF(SUMIF(Table132617209122124[Type of Care], \"QI\", Table132617209122124[[Duration ]])<= 3, SUMIF(Table132617209122124[Type of Care], \"QI\", Table132617209122124[[Duration ]]), 0))))  > 90, SUMIFS($G$86:G91, $D$86:D91,\"Direct/Indirect/Clinical Administration\",  $B$86:B91,\"<=\"&$D$83 + 14)+ ((IF(SUMIF(Table132617209122124[Type of Care], \"QI\", Table132617209122124[[Duration ]])>= 4, 4,IF(SUMIF(Table132617209122124[Type of Care], \"QI\", Table132617209122124[[Duration ]])<= 3, SUMIF(Table132617209122124[Type of Care], \"QI\", Table132617209122124[[Duration ]]), 0))))> 90)","v":false}]
[null,null,"",null,null,null,null,{"$f":"IF( B92 > $D$83+14, SUMIFS($G$86:G92, $D$86:D92,\"Direct/Indirect/Clinical Administration\", $B$86:B92,\">\"&$D$83 + 14) + ((IF(SUMIF(Table132617209122124[Type of Care], \"QI\", Table132617209122124[[Duration ]])>= 4, 4,IF(SUMIF(Table132617209122124[Type of Care], \"QI\", Table132617209122124[[Duration ]])<= 3, SUMIF(Table132617209122124[Type of Care], \"QI\", Table132617209122124[[Duration ]]), 0))))  > 90, SUMIFS($G$86:G92, $D$86:D92,\"Direct/Indirect/Clinical Administration\",  $B$86:B92,\"<=\"&$D$83 + 14)+ ((IF(SUMIF(Table132617209122124[Type of Care], \"QI\", Table132617209122124[[Duration ]])>= 4, 4,IF(SUMIF(Table132617209122124[Type of Care], \"QI\", Table132617209122124[[Duration ]])<= 3, SUMIF(Table132617209122124[Type of Care], \"QI\", Table132617209122124[[Duration ]]), 0))))> 90)","v":false}]
[null,null,"",null,null,null,null,{"$f":"IF( B93 > $D$83+14, SUMIFS($G$86:G93, $D$86:D93,\"Direct/Indirect/Clinical Administration\", $B$86:B93,\">\"&$D$83 + 14) + ((IF(SUMIF(Table132617209122124[Type of Care], \"QI\", Table132617209122124[[Duration ]])>= 4, 4,IF(SUMIF(Table132617209122124[Type of Care], \"QI\", Table132617209122124[[Duration ]])<= 3, SUMIF(Table132617209122124[Type of Care], \"QI\", Table132617209122124[[Duration ]]), 0))))  > 90, SUMIFS($G$86:G93, $D$86:D93,\"Direct/Indirect/Clinical Administration\",  $B$86:B93,\"<=\"&$D$83 + 14)+ ((IF(SUMIF(Table132617209122124[Type of Care], \"QI\", Table132617209122124[[Duration ]])>= 4, 4,IF(SUMIF(Table132617209122124[Type of Care], \"QI\", Table132617209122124[[Duration ]])<= 3, SUMIF(Table132617209122124[Type of Care], \"QI\", Table132617209122124[[Duration ]]), 0))))> 90)","v":false}]
[null,null,"",null,null,null,null,{"$f":"IF( B94 > $D$83+14, SUMIFS($G$86:G94, $D$86:D94,\"Direct/Indirect/Clinical Administration\", $B$86:B94,\">\"&$D$83 + 14) + ((IF(SUMIF(Table132617209122124[Type of Care], \"QI\", Table132617209122124[[Duration ]])>= 4, 4,IF(SUMIF(Table132617209122124[Type of Care], \"QI\", Table132617209122124[[Duration ]])<= 3, SUMIF(Table132617209122124[Type of Care], \"QI\", Table132617209122124[[Duration ]]), 0))))  > 90, SUMIFS($G$86:G94, $D$86:D94,\"Direct/Indirect/Clinical Administration\",  $B$86:B94,\"<=\"&$D$83 + 14)+ ((IF(SUMIF(Table132617209122124[Type of Care], \"QI\", Table132617209122124[[Duration ]])>= 4, 4,IF(SUMIF(Table132617209122124[Type of Care], \"QI\", Table132617209122124[[Duration ]])<= 3, SUMIF(Table132617209122124[Type of Care], \"QI\", Table132617209122124[[Duration ]]), 0))))> 90)","v":false}]
[null,null,"",null,null,null,null,{"$f":"IF( B95 > $D$83+14, SUMIFS($G$86:G95, $D$86:D95,\"Direct/Indirect/Clinical Administration\", $B$86:B95,\">\"&$D$83 + 14) + ((IF(SUMIF(Table132617209122124[Type of Care], \"QI\", Table132617209122124[[Duration ]])>= 4, 4,IF(SUMIF(Table132617209122124[Type of Care], \"QI\", Table132617209122124[[Duration ]])<= 3, SUMIF(Table132617209122124[Type of Care], \"QI\", Table132617209122124[[Duration ]]), 0))))  > 90, SUMIFS($G$86:G95, $D$86:D95,\"Direct/Indirect/Clinical Administration\",  $B$86:B95,\"<=\"&$D$83 + 14)+ ((IF(SUMIF(Table132617209122124[Type of Care], \"QI\", Table132617209122124[[Duration ]])>= 4, 4,IF(SUMIF(Table132617209122124[Type of Care], \"QI\", Table132617209122124[[Duration ]])<= 3, SUMIF(Table132617209122124[Type of Care], \"QI\", Table132617209122124[[Duration ]]), 0))))> 90)","v":false}]
[null,null,"",null,null,null,null,{"$f":"IF( B96 > $D$83+14, SUMIFS($G$86:G96, $D$86:D96,\"Direct/Indirect/Clinical Administration\", $B$86:B96,\">\"&$D$83 + 14) + ((IF(SUMIF(Table132617209122124[Type of Care], \"QI\", Table132617209122124[[Duration ]])>= 4, 4,IF(SUMIF(Table132617209122124[Type of Care], \"QI\", Table132617209122124[[Duration ]])<= 3, SUMIF(Table132617209122124[Type of Care], \"QI\", Table132617209122124[[Duration ]]), 0))))  > 90, SUMIFS($G$86:G96, $D$86:D96,\"Direct/Indirect/Clinical Administration\",  $B$86:B96,\"<=\"&$D$83 + 14)+ ((IF(SUMIF(Table132617209122124[Type of Care], \"QI\", Table132617209122124[[Duration ]])>= 4, 4,IF(SUMIF(Table132617209122124[Type of Care], \"QI\", Table132617209122124[[Duration ]])<= 3, SUMIF(Table132617209122124[Type of Care], \"QI\", Table132617209122124[[Duration ]]), 0))))> 90)","v":false}]
[null,null,"",null,null,null,null,{"$f":"IF( B97 > $D$83+14, SUMIFS($G$86:G97, $D$86:D97,\"Direct/Indirect/Clinical Administration\", $B$86:B97,\">\"&$D$83 + 14) + ((IF(SUMIF(Table132617209122124[Type of Care], \"QI\", Table132617209122124[[Duration ]])>= 4, 4,IF(SUMIF(Table132617209122124[Type of Care], \"QI\", Table132617209122124[[Duration ]])<= 3, SUMIF(Table132617209122124[Type of Care], \"QI\", Table132617209122124[[Duration ]]), 0))))  > 90, SUMIFS($G$86:G97, $D$86:D97,\"Direct/Indirect/Clinical Administration\",  $B$86:B97,\"<=\"&$D$83 + 14)+ ((IF(SUMIF(Table132617209122124[Type of Care], \"QI\", Table132617209122124[[Duration ]])>= 4, 4,IF(SUMIF(Table132617209122124[Type of Care], \"QI\", Table132617209122124[[Duration ]])<= 3, SUMIF(Table132617209122124[Type of Care], \"QI\", Table132617209122124[[Duration ]]), 0))))> 90)","v":false}]
[null,null,"",null,null,null,null,{"$f":"IF( B98 > $D$83+14, SUMIFS($G$86:G98, $D$86:D98,\"Direct/Indirect/Clinical Administration\", $B$86:B98,\">\"&$D$83 + 14) + ((IF(SUMIF(Table132617209122124[Type of Care], \"QI\", Table132617209122124[[Duration ]])>= 4, 4,IF(SUMIF(Table132617209122124[Type of Care], \"QI\", Table132617209122124[[Duration ]])<= 3, SUMIF(Table132617209122124[Type of Care], \"QI\", Table132617209122124[[Duration ]]), 0))))  > 90, SUMIFS($G$86:G98, $D$86:D98,\"Direct/Indirect/Clinical Administration\",  $B$86:B98,\"<=\"&$D$83 + 14)+ ((IF(SUMIF(Table132617209122124[Type of Care], \"QI\", Table132617209122124[[Duration ]])>= 4, 4,IF(SUMIF(Table132617209122124[Type of Care], \"QI\", Table132617209122124[[Duration ]])<= 3, SUMIF(Table132617209122124[Type of Care], \"QI\", Table132617209122124[[Duration ]]), 0))))> 90)","v":false}]
[null,null,"",null,null,null,null,{"$f":"IF( B99 > $D$83+14, SUMIFS($G$86:G99, $D$86:D99,\"Direct/Indirect/Clinical Administration\", $B$86:B99,\">\"&$D$83 + 14) + ((IF(SUMIF(Table132617209122124[Type of Care], \"QI\", Table132617209122124[[Duration ]])>= 4, 4,IF(SUMIF(Table132617209122124[Type of Care], \"QI\", Table132617209122124[[Duration ]])<= 3, SUMIF(Table132617209122124[Type of Care], \"QI\", Table132617209122124[[Duration ]]), 0))))  > 90, SUMIFS($G$86:G99, $D$86:D99,\"Direct/Indirect/Clinical Administration\",  $B$86:B99,\"<=\"&$D$83 + 14)+ ((IF(SUMIF(Table132617209122124[Type of Care], \"QI\", Table132617209122124[[Duration ]])>= 4, 4,IF(SUMIF(Table132617209122124[Type of Care], \"QI\", Table132617209122124[[Duration ]])<= 3, SUMIF(Table132617209122124[Type of Care], \"QI\", Table132617209122124[[Duration ]]), 0))))> 90)","v":false}]
[null,null,"",null,null,null,null,{"$f":"IF( B100 > $D$83+14, SUMIFS($G$86:G100, $D$86:D100,\"Direct/Indirect/Clinical Administration\", $B$86:B100,\">\"&$D$83 + 14) + ((IF(SUMIF(Table132617209122124[Type of Care], \"QI\", Table132617209122124[[Duration ]])>= 4, 4,IF(SUMIF(Table132617209122124[Type of Care], \"QI\", Table132617209122124[[Duration ]])<= 3, SUMIF(Table132617209122124[Type of Care], \"QI\", Table132617209122124[[Duration ]]), 0))))  > 90, SUMIFS($G$86:G100, $D$86:D100,\"Direct/Indirect/Clinical Administration\",  $B$86:B100,\"<=\"&$D$83 + 14)+ ((IF(SUMIF(Table132617209122124[Type of Care], \"QI\", Table132617209122124[[Duration ]])>= 4, 4,IF(SUMIF(Table132617209122124[Type of Care], \"QI\", Table132617209122124[[Duration ]])<= 3, SUMIF(Table132617209122124[Type of Care], \"QI\", Table132617209122124[[Duration ]]), 0))))> 90)","v":false}]
[null,null,"",null,null,null,null,{"$f":"IF( B101 > $D$83+14, SUMIFS($G$86:G101, $D$86:D101,\"Direct/Indirect/Clinical Administration\", $B$86:B101,\">\"&$D$83 + 14) + ((IF(SUMIF(Table132617209122124[Type of Care], \"QI\", Table132617209122124[[Duration ]])>= 4, 4,IF(SUMIF(Table132617209122124[Type of Care], \"QI\", Table132617209122124[[Duration ]])<= 3, SUMIF(Table132617209122124[Type of Care], \"QI\", Table132617209122124[[Duration ]]), 0))))  > 90, SUMIFS($G$86:G101, $D$86:D101,\"Direct/Indirect/Clinical Administration\",  $B$86:B101,\"<=\"&$D$83 + 14)+ ((IF(SUMIF(Table132617209122124[Type of Care], \"QI\", Table132617209122124[[Duration ]])>= 4, 4,IF(SUMIF(Table132617209122124[Type of Care], \"QI\", Table132617209122124[[Duration ]])<= 3, SUMIF(Table132617209122124[Type of Care], \"QI\", Table132617209122124[[Duration ]]), 0))))> 90)","v":false}]
[null,null,"",null,null,null,null,{"$f":"IF( B102 > $D$83+14, SUMIFS($G$86:G102, $D$86:D102,\"Direct/Indirect/Clinical Administration\", $B$86:B102,\">\"&$D$83 + 14) + ((IF(SUMIF(Table132617209122124[Type of Care], \"QI\", Table132617209122124[[Duration ]])>= 4, 4,IF(SUMIF(Table132617209122124[Type of Care], \"QI\", Table132617209122124[[Duration ]])<= 3, SUMIF(Table132617209122124[Type of Care], \"QI\", Table132617209122124[[Duration ]]), 0))))  > 90, SUMIFS($G$86:G102, $D$86:D102,\"Direct/Indirect/Clinical Administration\",  $B$86:B102,\"<=\"&$D$83 + 14)+ ((IF(SUMIF(Table132617209122124[Type of Care], \"QI\", Table132617209122124[[Duration ]])>= 4, 4,IF(SUMIF(Table132617209122124[Type of Care], \"QI\", Table132617209122124[[Duration ]])<= 3, SUMIF(Table132617209122124[Type of Care], \"QI\", Table132617209122124[[Duration ]]), 0))))> 90)","v":false}]
[null,null,"",null,null,null,null,{"$f":"IF( B103 > $D$83+14, SUMIFS($G$86:G103, $D$86:D103,\"Direct/Indirect/Clinical Administration\", $B$86:B103,\">\"&$D$83 + 14) + ((IF(SUMIF(Table132617209122124[Type of Care], \"QI\", Table132617209122124[[Duration ]])>= 4, 4,IF(SUMIF(Table132617209122124[Type of Care], \"QI\", Table132617209122124[[Duration ]])<= 3, SUMIF(Table132617209122124[Type of Care], \"QI\", Table132617209122124[[Duration ]]), 0))))  > 90, SUMIFS($G$86:G103, $D$86:D103,\"Direct/Indirect/Clinical Administration\",  $B$86:B103,\"<=\"&$D$83 + 14)+ ((IF(SUMIF(Table132617209122124[Type of Care], \"QI\", Table132617209122124[[Duration ]])>= 4, 4,IF(SUMIF(Table132617209122124[Type of Care], \"QI\", Table132617209122124[[Duration ]])<= 3, SUMIF(Table132617209122124[Type of Care], \"QI\", Table132617209122124[[Duration ]]), 0))))> 90)","v":false}]
[null,null,"",null,null,null,null,{"$f":"IF( B104 > $D$83+14, SUMIFS($G$86:G104, $D$86:D104,\"Direct/Indirect/Clinical Administration\", $B$86:B104,\">\"&$D$83 + 14) + ((IF(SUMIF(Table132617209122124[Type of Care], \"QI\", Table132617209122124[[Duration ]])>= 4, 4,IF(SUMIF(Table132617209122124[Type of Care], \"QI\", Table132617209122124[[Duration ]])<= 3, SUMIF(Table132617209122124[Type of Care], \"QI\", Table132617209122124[[Duration ]]), 0))))  > 90, SUMIFS($G$86:G104, $D$86:D104,\"Direct/Indirect/Clinical Administration\",  $B$86:B104,\"<=\"&$D$83 + 14)+ ((IF(SUMIF(Table132617209122124[Type of Care], \"QI\", Table132617209122124[[Duration ]])>= 4, 4,IF(SUMIF(Table132617209122124[Type of Care], \"QI\", Table132617209122124[[Duration ]])<= 3, SUMIF(Table132617209122124[Type of Care], \"QI\", Table132617209122124[[Duration ]]), 0))))> 90)","v":false}]
[null,null,"",null,null,null,null,{"$f":"IF( B105 > $D$83+14, SUMIFS($G$86:G105, $D$86:D105,\"Direct/Indirect/Clinical Administration\", $B$86:B105,\">\"&$D$83 + 14) + ((IF(SUMIF(Table132617209122124[Type of Care], \"QI\", Table132617209122124[[Duration ]])>= 4, 4,IF(SUMIF(Table132617209122124[Type of Care], \"QI\", Table132617209122124[[Duration ]])<= 3, SUMIF(Table132617209122124[Type of Care], \"QI\", Table132617209122124[[Duration ]]), 0))))  > 90, SUMIFS($G$86:G105, $D$86:D105,\"Direct/Indirect/Clinical Administration\",  $B$86:B105,\"<=\"&$D$83 + 14)+ ((IF(SUMIF(Table132617209122124[Type of Care], \"QI\", Table132617209122124[[Duration ]])>= 4, 4,IF(SUMIF(Table132617209122124[Type of Care], \"QI\", Table132617209122124[[Duration ]])<= 3, SUMIF(Table132617209122124[Type of Care], \"QI\", Table132617209122124[[Duration ]]), 0))))> 90)","v":false}]
[null,null,"",null,null,null,null,{"$f":"IF( B106 > $D$83+14, SUMIFS($G$86:G106, $D$86:D106,\"Direct/Indirect/Clinical Administration\", $B$86:B106,\">\"&$D$83 + 14) + ((IF(SUMIF(Table132617209122124[Type of Care], \"QI\", Table132617209122124[[Duration ]])>= 4, 4,IF(SUMIF(Table132617209122124[Type of Care], \"QI\", Table132617209122124[[Duration ]])<= 3, SUMIF(Table132617209122124[Type of Care], \"QI\", Table132617209122124[[Duration ]]), 0))))  > 90, SUMIFS($G$86:G106, $D$86:D106,\"Direct/Indirect/Clinical Administration\",  $B$86:B106,\"<=\"&$D$83 + 14)+ ((IF(SUMIF(Table132617209122124[Type of Care], \"QI\", Table132617209122124[[Duration ]])>= 4, 4,IF(SUMIF(Table132617209122124[Type of Care], \"QI\", Table132617209122124[[Duration ]])<= 3, SUMIF(Table132617209122124[Type of Care], \"QI\", Table132617209122124[[Duration ]]), 0))))> 90)","v":false}]
[null,null,"",null,null,null,null,{"$f":"IF( B107 > $D$83+14, SUMIFS($G$86:G107, $D$86:D107,\"Direct/Indirect/Clinical Administration\", $B$86:B107,\">\"&$D$83 + 14) + ((IF(SUMIF(Table132617209122124[Type of Care], \"QI\", Table132617209122124[[Duration ]])>= 4, 4,IF(SUMIF(Table132617209122124[Type of Care], \"QI\", Table132617209122124[[Duration ]])<= 3, SUMIF(Table132617209122124[Type of Care], \"QI\", Table132617209122124[[Duration ]]), 0))))  > 90, SUMIFS($G$86:G107, $D$86:D107,\"Direct/Indirect/Clinical Administration\",  $B$86:B107,\"<=\"&$D$83 + 14)+ ((IF(SUMIF(Table132617209122124[Type of Care], \"QI\", Table132617209122124[[Duration ]])>= 4, 4,IF(SUMIF(Table132617209122124[Type of Care], \"QI\", Table132617209122124[[Duration ]])<= 3, SUMIF(Table132617209122124[Type of Care], \"QI\", Table132617209122124[[Duration ]]), 0))))> 90)","v":false}]
[null,null,"",null,null,null,null,{"$f":"IF( B108 > $D$83+14, SUMIFS($G$86:G108, $D$86:D108,\"Direct/Indirect/Clinical Administration\", $B$86:B108,\">\"&$D$83 + 14) + ((IF(SUMIF(Table132617209122124[Type of Care], \"QI\", Table132617209122124[[Duration ]])>= 4, 4,IF(SUMIF(Table132617209122124[Type of Care], \"QI\", Table132617209122124[[Duration ]])<= 3, SUMIF(Table132617209122124[Type of Care], \"QI\", Table132617209122124[[Duration ]]), 0))))  > 90, SUMIFS($G$86:G108, $D$86:D108,\"Direct/Indirect/Clinical Administration\",  $B$86:B108,\"<=\"&$D$83 + 14)+ ((IF(SUMIF(Table132617209122124[Type of Care], \"QI\", Table132617209122124[[Duration ]])>= 4, 4,IF(SUMIF(Table132617209122124[Type of Care], \"QI\", Table132617209122124[[Duration ]])<= 3, SUMIF(Table132617209122124[Type of Care], \"QI\", Table132617209122124[[Duration ]]), 0))))> 90)","v":false}]
[null,null,"",null,null,null,null,{"$f":"IF( B109 > $D$83+14, SUMIFS($G$86:G109, $D$86:D109,\"Direct/Indirect/Clinical Administration\", $B$86:B109,\">\"&$D$83 + 14) + ((IF(SUMIF(Table132617209122124[Type of Care], \"QI\", Table132617209122124[[Duration ]])>= 4, 4,IF(SUMIF(Table132617209122124[Type of Care], \"QI\", Table132617209122124[[Duration ]])<= 3, SUMIF(Table132617209122124[Type of Care], \"QI\", Table132617209122124[[Duration ]]), 0))))  > 90, SUMIFS($G$86:G109, $D$86:D109,\"Direct/Indirect/Clinical Administration\",  $B$86:B109,\"<=\"&$D$83 + 14)+ ((IF(SUMIF(Table132617209122124[Type of Care], \"QI\", Table132617209122124[[Duration ]])>= 4, 4,IF(SUMIF(Table132617209122124[Type of Care], \"QI\", Table132617209122124[[Duration ]])<= 3, SUMIF(Table132617209122124[Type of Care], \"QI\", Table132617209122124[[Duration ]]), 0))))> 90)","v":false}]
[null,null,"",null,null,null,null,{"$f":"IF( B110 > $D$83+14, SUMIFS($G$86:G110, $D$86:D110,\"Direct/Indirect/Clinical Administration\", $B$86:B110,\">\"&$D$83 + 14) + ((IF(SUMIF(Table132617209122124[Type of Care], \"QI\", Table132617209122124[[Duration ]])>= 4, 4,IF(SUMIF(Table132617209122124[Type of Care], \"QI\", Table132617209122124[[Duration ]])<= 3, SUMIF(Table132617209122124[Type of Care], \"QI\", Table132617209122124[[Duration ]]), 0))))  > 90, SUMIFS($G$86:G110, $D$86:D110,\"Direct/Indirect/Clinical Administration\",  $B$86:B110,\"<=\"&$D$83 + 14)+ ((IF(SUMIF(Table132617209122124[Type of Care], \"QI\", Table132617209122124[[Duration ]])>= 4, 4,IF(SUMIF(Table132617209122124[Type of Care], \"QI\", Table132617209122124[[Duration ]])<= 3, SUMIF(Table132617209122124[Type of Care], \"QI\", Table132617209122124[[Duration ]]), 0))))> 90)","v":false}]
[null,null,"",null,null,null,null,{"$f":"IF( B111 > $D$83+14, SUMIFS($G$86:G111, $D$86:D111,\"Direct/Indirect/Clinical Administration\", $B$86:B111,\">\"&$D$83 + 14) + ((IF(SUMIF(Table132617209122124[Type of Care], \"QI\", Table132617209122124[[Duration ]])>= 4, 4,IF(SUMIF(Table132617209122124[Type of Care], \"QI\", Table132617209122124[[Duration ]])<= 3, SUMIF(Table132617209122124[Type of Care], \"QI\", Table132617209122124[[Duration ]]), 0))))  > 90, SUMIFS($G$86:G111, $D$86:D111,\"Direct/Indirect/Clinical Administration\",  $B$86:B111,\"<=\"&$D$83 + 14)+ ((IF(SUMIF(Table132617209122124[Type of Care], \"QI\", Table132617209122124[[Duration ]])>= 4, 4,IF(SUMIF(Table132617209122124[Type of Care], \"QI\", Table132617209122124[[Duration ]])<= 3, SUMIF(Table132617209122124[Type of Care], \"QI\", Table132617209122124[[Duration ]]), 0))))> 90)","v":false}]
[null,null,"",null,null,null,null,{"$f":"IF( B112 > $D$83+14, SUMIFS($G$86:G112, $D$86:D112,\"Direct/Indirect/Clinical Administration\", $B$86:B112,\">\"&$D$83 + 14) + ((IF(SUMIF(Table132617209122124[Type of Care], \"QI\", Table132617209122124[[Duration ]])>= 4, 4,IF(SUMIF(Table132617209122124[Type of Care], \"QI\", Table132617209122124[[Duration ]])<= 3, SUMIF(Table132617209122124[Type of Care], \"QI\", Table132617209122124[[Duration ]]), 0))))  > 90, SUMIFS($G$86:G112, $D$86:D112,\"Direct/Indirect/Clinical Administration\",  $B$86:B112,\"<=\"&$D$83 + 14)+ ((IF(SUMIF(Table132617209122124[Type of Care], \"QI\", Table132617209122124[[Duration ]])>= 4, 4,IF(SUMIF(Table132617209122124[Type of Care], \"QI\", Table132617209122124[[Duration ]])<= 3, SUMIF(Table132617209122124[Type of Care], \"QI\", Table132617209122124[[Duration ]]), 0))))> 90)","v":false}]
[null,null,"",null,null,null,null,{"$f":"IF( B113 > $D$83+14, SUMIFS($G$86:G113, $D$86:D113,\"Direct/Indirect/Clinical Administration\", $B$86:B113,\">\"&$D$83 + 14) + ((IF(SUMIF(Table132617209122124[Type of Care], \"QI\", Table132617209122124[[Duration ]])>= 4, 4,IF(SUMIF(Table132617209122124[Type of Care], \"QI\", Table132617209122124[[Duration ]])<= 3, SUMIF(Table132617209122124[Type of Care], \"QI\", Table132617209122124[[Duration ]]), 0))))  > 90, SUMIFS($G$86:G113, $D$86:D113,\"Direct/Indirect/Clinical Administration\",  $B$86:B113,\"<=\"&$D$83 + 14)+ ((IF(SUMIF(Table132617209122124[Type of Care], \"QI\", Table132617209122124[[Duration ]])>= 4, 4,IF(SUMIF(Table132617209122124[Type of Care], \"QI\", Table132617209122124[[Duration ]])<= 3, SUMIF(Table132617209122124[Type of Care], \"QI\", Table132617209122124[[Duration ]]), 0))))> 90)","v":false}]
[null,null,"",null,null,null,null,{"$f":"IF( B114 > $D$83+14, SUMIFS($G$86:G114, $D$86:D114,\"Direct/Indirect/Clinical Administration\", $B$86:B114,\">\"&$D$83 + 14) + ((IF(SUMIF(Table132617209122124[Type of Care], \"QI\", Table132617209122124[[Duration ]])>= 4, 4,IF(SUMIF(Table132617209122124[Type of Care], \"QI\", Table132617209122124[[Duration ]])<= 3, SUMIF(Table132617209122124[Type of Care], \"QI\", Table132617209122124[[Duration ]]), 0))))  > 90, SUMIFS($G$86:G114, $D$86:D114,\"Direct/Indirect/Clinical Administration\",  $B$86:B114,\"<=\"&$D$83 + 14)+ ((IF(SUMIF(Table132617209122124[Type of Care], \"QI\", Table132617209122124[[Duration ]])>= 4, 4,IF(SUMIF(Table132617209122124[Type of Care], \"QI\", Table132617209122124[[Duration ]])<= 3, SUMIF(Table132617209122124[Type of Care], \"QI\", Table132617209122124[[Duration ]]), 0))))> 90)","v":false}]
[null,null,{"$f":"IF(B115=\"\", \"\", B115)","v":""},null,null,"Total Contract Hours",{"$f":"(SUMIF(Table132617209122124[Type of Care], \"Direct/Indirect/Clinical Administration\",Table132617209122124[[Duration ]]))","v":0},"CT3"]
[null,null,null,null,null,"Total Included QI Hours",{"$f":"(IF(SUMIF(Table132617209122124[Type of Care], \"QI\", Table132617209122124[[Duration ]])>= 4, 4,IF(SUMIF(Table132617209122124[Type of Care], \"QI\", Table132617209122124[[Duration ]])<= 3, SUMIF(Table132617209122124[Type of Care], \"QI\", Table132617209122124[[Duration ]]), 0)))","v":0},"QI3"]
[null,null,null,null,null,"Total Excluded Hours",{"$f":"G118+G119","v":0},"EX3"]
[null,null,null,null,null,"         Excluded Contract Hours",{"$f":"(SUMIF(Table132617209122124[Type of Care], \"Third Party/Specialist FFS\",Table132617209122124[[Duration ]])) + (SUMIF(Table132617209122124[Type of Care], \"Break (>15 Minutes)\", Table132617209122124[[Duration ]]))","v":0},"EXC3"]
[null,null,null,null,null,"      Excluded QI Hours",{"$f":"(SUMIF(Table132617209122124[Type of Care], \"QI\", Table132617209122124[[Duration ]]) - (IF(SUMIF(Table132617209122124[Type of Care], \"QI\", Table132617209122124[[Duration ]])>= 4, 4,IF(SUMIF(Table132617209122124[Type of Care], \"QI\", Table132617209122124[[Duration ]])<= 3, SUMIF(Table132617209122124[Type of Care], \"QI\", Table132617209122124[[Duration ]]), 0))))","v":0},"EXQI3"]
[null,null,{"$f":"IF(B120=\"\", \"\", B120)","v":""},null,null,"Hours Above 90hr/semi-monthly",{"$f":"  (IF(SUMIFS(Table132617209122124[[Duration ]],Table132617209122124[Date (YYYY-MM-DD)], \">\"&$D$83+14, Table132617209122124[Type of Care], \"Direct/Indirect/Clinical Administration\")>= 90, (SUMIFS(Table132617209122124[[Duration ]],Table132617209122124[Date (YYYY-MM-DD)], \">\"&$D$83+14, Table132617209122124[Type of Care], \"Direct/Indirect/Clinical Administration\")+ (IF(SUMIF(Table132617209122124[Type of Care], \"QI\", Table132617209122124[[Duration ]])>= 4, 4,IF(SUMIF(Table132617209122124[Type of Care], \"QI\", Table132617209122124[[Duration ]])<= 3, SUMIF(Table132617209122124[Type of Care], \"QI\",Table132617209122124[[Duration ]]), 0))) -90))) + (IF(SUMIFS(Table132617209122124[[Duration ]],Table132617209122124[Date (YYYY-MM-DD)], \"<=\"&$D$83+14, Table132617209122124[Type of Care], \"Direct/Indirect/Clinical Administration\")>= 90, (SUMIFS(Table132617209122124[[Duration ]],Table132617209122124[Date (YYYY-MM-DD)], \"<=\"&$D$83+14, Table132617209122124[Type of Care], \"Direct/Indirect/Clinical Administration\")+ (IF(SUMIF(Table132617209122124[Type of Care], \"QI\", Table132617209122124[[Duration ]])>= 4, 4,IF(SUMIF(Table132617209122124[Type of Care], \"QI\", Table132617209122124[[Duration ]])<= 3, SUMIF(Table132617209122124[Type of Care], \"QI\",Table132617209122124[[Duration ]]), 0))) -90)))","v":0},"A903"]

{"sheet":"Physician 8","index":8,"n_rows":120,"n_cols":8,"rows_kept":120,"cut":false,"hidden":false,"merged":[]}
[]
[null,"[Physician Name]"]
[null,"Practitioner #:",0]
[null,"Annual Rate: ",0]
[null,"Qrt. Disbursement: ",0]
[null,null,"Jan - Mar"]
[null,"Total Contract \nHours","Total Included \nQI Hours","Excluded Contract \nHours"]
[null,{"$f":"G35+G75+G115","v":0},{"$f":"G36+G76+G116","v":0},{"$f":"G37+G77+G117","v":0},null,null,null,"Totals"]
[]
[null,{"$f":"IF(Clinic!C5=\"Jan - Mar\", \"January\", IF(Clinic!C5= \"Apr - June\", \"April\", IF(Clinic!C5=\"July - Sept\", \"July\", IF(Clinic!C5=\" Oct - Dec\", \"October\"))))","v":"January"},{"$f":"Clinic!C6","v":2021},{"$f":"DATE(YEAR(B13),MONTH(DATEVALUE(B10&\"1\")),1)","v":"1900-01-01"},null,null,null,"Month1"]
[]
[null,"Date (YYYY-MM-DD)","Day ","Type of Care","Start Time AM/PM","End Time AM/PM","Duration","FALSE/TRUE"]
[null,null,{"$f":"IF(B13=\"\", \"\", B13)","v":""},null,null,null,null,{"$f":"IF( B13 > $D$10+14, SUMIFS($G$13:G13, $D$13:D13,\"Direct/Indirect/Clinical Administration\", $B$13:B13,\">\"&$D$10 + 14) + ((IF(SUMIF(Table131518710132225[Type of Care], \"QI\", Table131518710132225[Duration])>= 4, 4,IF(SUMIF(Table131518710132225[Type of Care], \"QI\", Table131518710132225[Duration])<= 3, SUMIF(Table131518710132225[Type of Care], \"QI\", Table131518710132225[Duration]), 0))))  > 90, SUMIFS($G$13:G13, $D$13:D13,\"Direct/Indirect/Clinical Administration\",  $B$13:B13,\"<=\"&$D$10 + 14)+ ((IF(SUMIF(Table131518710132225[Type of Care], \"QI\", Table131518710132225[Duration])>= 4, 4,IF(SUMIF(Table131518710132225[Type of Care], \"QI\", Table131518710132225[Duration])<= 3, SUMIF(Table131518710132225[Type of Care], \"QI\", Table131518710132225[Duration]), 0))))> 90)","v":false}]
[null,null,{"$f":"IF(B14=\"\", \"\", B14)","v":""},null,null,null,null,{"$f":"IF( B14 > $D$10+14, SUMIFS($G$13:G14, $D$13:D14,\"Direct/Indirect/Clinical Administration\", $B$13:B14,\">\"&$D$10 + 14) + ((IF(SUMIF(Table131518710132225[Type of Care], \"QI\", Table131518710132225[Duration])>= 4, 4,IF(SUMIF(Table131518710132225[Type of Care], \"QI\", Table131518710132225[Duration])<= 3, SUMIF(Table131518710132225[Type of Care], \"QI\", Table131518710132225[Duration]), 0))))  > 90, SUMIFS($G$13:G14, $D$13:D14,\"Direct/Indirect/Clinical Administration\",  $B$13:B14,\"<=\"&$D$10 + 14)+ ((IF(SUMIF(Table131518710132225[Type of Care], \"QI\", Table131518710132225[Duration])>= 4, 4,IF(SUMIF(Table131518710132225[Type of Care], \"QI\", Table131518710132225[Duration])<= 3, SUMIF(Table131518710132225[Type of Care], \"QI\", Table131518710132225[Duration]), 0))))> 90)","v":false}]
[null,null,"",null,null,null,null,{"$f":"IF( B15 > $D$10+14, SUMIFS($G$13:G15, $D$13:D15,\"Direct/Indirect/Clinical Administration\", $B$13:B15,\">\"&$D$10 + 14) + ((IF(SUMIF(Table131518710132225[Type of Care], \"QI\", Table131518710132225[Duration])>= 4, 4,IF(SUMIF(Table131518710132225[Type of Care], \"QI\", Table131518710132225[Duration])<= 3, SUMIF(Table131518710132225[Type of Care], \"QI\", Table131518710132225[Duration]), 0))))  > 90, SUMIFS($G$13:G15, $D$13:D15,\"Direct/Indirect/Clinical Administration\",  $B$13:B15,\"<=\"&$D$10 + 14)+ ((IF(SUMIF(Table131518710132225[Type of Care], \"QI\", Table131518710132225[Duration])>= 4, 4,IF(SUMIF(Table131518710132225[Type of Care], \"QI\", Table131518710132225[Duration])<= 3, SUMIF(Table131518710132225[Type of Care], \"QI\", Table131518710132225[Duration]), 0))))> 90)","v":false}]
[null,null,"",null,null,null,null,{"$f":"IF( B16 > $D$10+14, SUMIFS($G$13:G16, $D$13:D16,\"Direct/Indirect/Clinical Administration\", $B$13:B16,\">\"&$D$10 + 14) + ((IF(SUMIF(Table131518710132225[Type of Care], \"QI\", Table131518710132225[Duration])>= 4, 4,IF(SUMIF(Table131518710132225[Type of Care], \"QI\", Table131518710132225[Duration])<= 3, SUMIF(Table131518710132225[Type of Care], \"QI\", Table131518710132225[Duration]), 0))))  > 90, SUMIFS($G$13:G16, $D$13:D16,\"Direct/Indirect/Clinical Administration\",  $B$13:B16,\"<=\"&$D$10 + 14)+ ((IF(SUMIF(Table131518710132225[Type of Care], \"QI\", Table131518710132225[Duration])>= 4, 4,IF(SUMIF(Table131518710132225[Type of Care], \"QI\", Table131518710132225[Duration])<= 3, SUMIF(Table131518710132225[Type of Care], \"QI\", Table131518710132225[Duration]), 0))))> 90)","v":false}]
[null,null,"",null,null,null,null,{"$f":"IF( B17 > $D$10+14, SUMIFS($G$13:G17, $D$13:D17,\"Direct/Indirect/Clinical Administration\", $B$13:B17,\">\"&$D$10 + 14) + ((IF(SUMIF(Table131518710132225[Type of Care], \"QI\", Table131518710132225[Duration])>= 4, 4,IF(SUMIF(Table131518710132225[Type of Care], \"QI\", Table131518710132225[Duration])<= 3, SUMIF(Table131518710132225[Type of Care], \"QI\", Table131518710132225[Duration]), 0))))  > 90, SUMIFS($G$13:G17, $D$13:D17,\"Direct/Indirect/Clinical Administration\",  $B$13:B17,\"<=\"&$D$10 + 14)+ ((IF(SUMIF(Table131518710132225[Type of Care], \"QI\", Table131518710132225[Duration])>= 4, 4,IF(SUMIF(Table131518710132225[Type of Care], \"QI\", Table131518710132225[Duration])<= 3, SUMIF(Table131518710132225[Type of Care], \"QI\", Table131518710132225[Duration]), 0))))> 90)","v":false}]
[null,null,"",null,null,null,null,{"$f":"IF( B18 > $D$10+14, SUMIFS($G$13:G18, $D$13:D18,\"Direct/Indirect/Clinical Administration\", $B$13:B18,\">\"&$D$10 + 14) + ((IF(SUMIF(Table131518710132225[Type of Care], \"QI\", Table131518710132225[Duration])>= 4, 4,IF(SUMIF(Table131518710132225[Type of Care], \"QI\", Table131518710132225[Duration])<= 3, SUMIF(Table131518710132225[Type of Care], \"QI\", Table131518710132225[Duration]), 0))))  > 90, SUMIFS($G$13:G18, $D$13:D18,\"Direct/Indirect/Clinical Administration\",  $B$13:B18,\"<=\"&$D$10 + 14)+ ((IF(SUMIF(Table131518710132225[Type of Care], \"QI\", Table131518710132225[Duration])>= 4, 4,IF(SUMIF(Table131518710132225[Type of Care], \"QI\", Table131518710132225[Duration])<= 3, SUMIF(Table131518710132225[Type of Care], \"QI\", Table131518710132225[Duration]), 0))))> 90)","v":false}]
[null,null,"",null,null,null,null,{"$f":"IF( B19 > $D$10+14, SUMIFS($G$13:G19, $D$13:D19,\"Direct/Indirect/Clinical Administration\", $B$13:B19,\">\"&$D$10 + 14) + ((IF(SUMIF(Table131518710132225[Type of Care], \"QI\", Table131518710132225[Duration])>= 4, 4,IF(SUMIF(Table131518710132225[Type of Care], \"QI\", Table131518710132225[Duration])<= 3, SUMIF(Table131518710132225[Type of Care], \"QI\", Table131518710132225[Duration]), 0))))  > 90, SUMIFS($G$13:G19, $D$13:D19,\"Direct/Indirect/Clinical Administration\",  $B$13:B19,\"<=\"&$D$10 + 14)+ ((IF(SUMIF(Table131518710132225[Type of Care], \"QI\", Table131518710132225[Duration])>= 4, 4,IF(SUMIF(Table131518710132225[Type of Care], \"QI\", Table131518710132225[Duration])<= 3, SUMIF(Table131518710132225[Type of Care], \"QI\", Table131518710132225[Duration]), 0))))> 90)","v":false}]
[null,null,"",null,null,null,null,{"$f":"IF( B20 > $D$10+14, SUMIFS($G$13:G20, $D$13:D20,\"Direct/Indirect/Clinical Administration\", $B$13:B20,\">\"&$D$10 + 14) + ((IF(SUMIF(Table131518710132225[Type of Care], \"QI\", Table131518710132225[Duration])>= 4, 4,IF(SUMIF(Table131518710132225[Type of Care], \"QI\", Table131518710132225[Duration])<= 3, SUMIF(Table131518710132225[Type of Care], \"QI\", Table131518710132225[Duration]), 0))))  > 90, SUMIFS($G$13:G20, $D$13:D20,\"Direct/Indirect/Clinical Administration\",  $B$13:B20,\"<=\"&$D$10 + 14)+ ((IF(SUMIF(Table131518710132225[Type of Care], \"QI\", Table131518710132225[Duration])>= 4, 4,IF(SUMIF(Table131518710132225[Type of Care], \"QI\", Table131518710132225[Duration])<= 3, SUMIF(Table131518710132225[Type of Care], \"QI\", Table131518710132225[Duration]), 0))))> 90)","v":false}]
[null,null,"",null,null,null,null,{"$f":"IF( B21 > $D$10+14, SUMIFS($G$13:G21, $D$13:D21,\"Direct/Indirect/Clinical Administration\", $B$13:B21,\">\"&$D$10 + 14) + ((IF(SUMIF(Table131518710132225[Type of Care], \"QI\", Table131518710132225[Duration])>= 4, 4,IF(SUMIF(Table131518710132225[Type of Care], \"QI\", Table131518710132225[Duration])<= 3, SUMIF(Table131518710132225[Type of Care], \"QI\", Table131518710132225[Duration]), 0))))  > 90, SUMIFS($G$13:G21, $D$13:D21,\"Direct/Indirect/Clinical Administration\",  $B$13:B21,\"<=\"&$D$10 + 14)+ ((IF(SUMIF(Table131518710132225[Type of Care], \"QI\", Table131518710132225[Duration])>= 4, 4,IF(SUMIF(Table131518710132225[Type of Care], \"QI\", Table131518710132225[Duration])<= 3, SUMIF(Table131518710132225[Type of Care], \"QI\", Table131518710132225[Duration]), 0))))> 90)","v":false}]
[null,null,"",null,null,null,null,{"$f":"IF( B22 > $D$10+14, SUMIFS($G$13:G22, $D$13:D22,\"Direct/Indirect/Clinical Administration\", $B$13:B22,\">\"&$D$10 + 14) + ((IF(SUMIF(Table131518710132225[Type of Care], \"QI\", Table131518710132225[Duration])>= 4, 4,IF(SUMIF(Table131518710132225[Type of Care], \"QI\", Table131518710132225[Duration])<= 3, SUMIF(Table131518710132225[Type of Care], \"QI\", Table131518710132225[Duration]), 0))))  > 90, SUMIFS($G$13:G22, $D$13:D22,\"Direct/Indirect/Clinical Administration\",  $B$13:B22,\"<=\"&$D$10 + 14)+ ((IF(SUMIF(Table131518710132225[Type of Care], \"QI\", Table131518710132225[Duration])>= 4, 4,IF(SUMIF(Table131518710132225[Type of Care], \"QI\", Table131518710132225[Duration])<= 3, SUMIF(Table131518710132225[Type of Care], \"QI\", Table131518710132225[Duration]), 0))))> 90)","v":false}]
[null,null,"",null,null,null,null,{"$f":"IF( B23 > $D$10+14, SUMIFS($G$13:G23, $D$13:D23,\"Direct/Indirect/Clinical Administration\", $B$13:B23,\">\"&$D$10 + 14) + ((IF(SUMIF(Table131518710132225[Type of Care], \"QI\", Table131518710132225[Duration])>= 4, 4,IF(SUMIF(Table131518710132225[Type of Care], \"QI\", Table131518710132225[Duration])<= 3, SUMIF(Table131518710132225[Type of Care], \"QI\", Table131518710132225[Duration]), 0))))  > 90, SUMIFS($G$13:G23, $D$13:D23,\"Direct/Indirect/Clinical Administration\",  $B$13:B23,\"<=\"&$D$10 + 14)+ ((IF(SUMIF(Table131518710132225[Type of Care], \"QI\", Table131518710132225[Duration])>= 4, 4,IF(SUMIF(Table131518710132225[Type of Care], \"QI\", Table131518710132225[Duration])<= 3, SUMIF(Table131518710132225[Type of Care], \"QI\", Table131518710132225[Duration]), 0))))> 90)","v":false}]
[null,null,"",null,null,null,null,{"$f":"IF( B24 > $D$10+14, SUMIFS($G$13:G24, $D$13:D24,\"Direct/Indirect/Clinical Administration\", $B$13:B24,\">\"&$D$10 + 14) + ((IF(SUMIF(Table131518710132225[Type of Care], \"QI\", Table131518710132225[Duration])>= 4, 4,IF(SUMIF(Table131518710132225[Type of Care], \"QI\", Table131518710132225[Duration])<= 3, SUMIF(Table131518710132225[Type of Care], \"QI\", Table131518710132225[Duration]), 0))))  > 90, SUMIFS($G$13:G24, $D$13:D24,\"Direct/Indirect/Clinical Administration\",  $B$13:B24,\"<=\"&$D$10 + 14)+ ((IF(SUMIF(Table131518710132225[Type of Care], \"QI\", Table131518710132225[Duration])>= 4, 4,IF(SUMIF(Table131518710132225[Type of Care], \"QI\", Table131518710132225[Duration])<= 3, SUMIF(Table131518710132225[Type of Care], \"QI\", Table131518710132225[Duration]), 0))))> 90)","v":false}]
[null,null,"",null,null,null,null,{"$f":"IF( B25 > $D$10+14, SUMIFS($G$13:G25, $D$13:D25,\"Direct/Indirect/Clinical Administration\", $B$13:B25,\">\"&$D$10 + 14) + ((IF(SUMIF(Table131518710132225[Type of Care], \"QI\", Table131518710132225[Duration])>= 4, 4,IF(SUMIF(Table131518710132225[Type of Care], \"QI\", Table131518710132225[Duration])<= 3, SUMIF(Table131518710132225[Type of Care], \"QI\", Table131518710132225[Duration]), 0))))  > 90, SUMIFS($G$13:G25, $D$13:D25,\"Direct/Indirect/Clinical Administration\",  $B$13:B25,\"<=\"&$D$10 + 14)+ ((IF(SUMIF(Table131518710132225[Type of Care], \"QI\", Table131518710132225[Duration])>= 4, 4,IF(SUMIF(Table131518710132225[Type of Care], \"QI\", Table131518710132225[Duration])<= 3, SUMIF(Table131518710132225[Type of Care], \"QI\", Table131518710132225[Duration]), 0))))> 90)","v":false}]
[null,null,"",null,null,null,null,{"$f":"IF( B26 > $D$10+14, SUMIFS($G$13:G26, $D$13:D26,\"Direct/Indirect/Clinical Administration\", $B$13:B26,\">\"&$D$10 + 14) + ((IF(SUMIF(Table131518710132225[Type of Care], \"QI\", Table131518710132225[Duration])>= 4, 4,IF(SUMIF(Table131518710132225[Type of Care], \"QI\", Table131518710132225[Duration])<= 3, SUMIF(Table131518710132225[Type of Care], \"QI\", Table131518710132225[Duration]), 0))))  > 90, SUMIFS($G$13:G26, $D$13:D26,\"Direct/Indirect/Clinical Administration\",  $B$13:B26,\"<=\"&$D$10 + 14)+ ((IF(SUMIF(Table131518710132225[Type of Care], \"QI\", Table131518710132225[Duration])>= 4, 4,IF(SUMIF(Table131518710132225[Type of Care], \"QI\", Table131518710132225[Duration])<= 3, SUMIF(Table131518710132225[Type of Care], \"QI\", Table131518710132225[Duration]), 0))))> 90)","v":false}]
[null,null,"",null,null,null,null,{"$f":"IF( B27 > $D$10+14, SUMIFS($G$13:G27, $D$13:D27,\"Direct/Indirect/Clinical Administration\", $B$13:B27,\">\"&$D$10 + 14) + ((IF(SUMIF(Table131518710132225[Type of Care], \"QI\", Table131518710132225[Duration])>= 4, 4,IF(SUMIF(Table131518710132225[Type of Care], \"QI\", Table131518710132225[Duration])<= 3, SUMIF(Table131518710132225[Type of Care], \"QI\", Table131518710132225[Duration]), 0))))  > 90, SUMIFS($G$13:G27, $D$13:D27,\"Direct/Indirect/Clinical Administration\",  $B$13:B27,\"<=\"&$D$10 + 14)+ ((IF(SUMIF(Table131518710132225[Type of Care], \"QI\", Table131518710132225[Duration])>= 4, 4,IF(SUMIF(Table131518710132225[Type of Care], \"QI\", Table131518710132225[Duration])<= 3, SUMIF(Table131518710132225[Type of Care], \"QI\", Table131518710132225[Duration]), 0))))> 90)","v":false}]
[null,null,"",null,null,null,null,{"$f":"IF( B28 > $D$10+14, SUMIFS($G$13:G28, $D$13:D28,\"Direct/Indirect/Clinical Administration\", $B$13:B28,\">\"&$D$10 + 14) + ((IF(SUMIF(Table131518710132225[Type of Care], \"QI\", Table131518710132225[Duration])>= 4, 4,IF(SUMIF(Table131518710132225[Type of Care], \"QI\", Table131518710132225[Duration])<= 3, SUMIF(Table131518710132225[Type of Care], \"QI\", Table131518710132225[Duration]), 0))))  > 90, SUMIFS($G$13:G28, $D$13:D28,\"Direct/Indirect/Clinical Administration\",  $B$13:B28,\"<=\"&$D$10 + 14)+ ((IF(SUMIF(Table131518710132225[Type of Care], \"QI\", Table131518710132225[Duration])>= 4, 4,IF(SUMIF(Table131518710132225[Type of Care], \"QI\", Table131518710132225[Duration])<= 3, SUMIF(Table131518710132225[Type of Care], \"QI\", Table131518710132225[Duration]), 0))))> 90)","v":false}]
[null,null,"",null,null,null,null,{"$f":"IF( B29 > $D$10+14, SUMIFS($G$13:G29, $D$13:D29,\"Direct/Indirect/Clinical Administration\", $B$13:B29,\">\"&$D$10 + 14) + ((IF(SUMIF(Table131518710132225[Type of Care], \"QI\", Table131518710132225[Duration])>= 4, 4,IF(SUMIF(Table131518710132225[Type of Care], \"QI\", Table131518710132225[Duration])<= 3, SUMIF(Table131518710132225[Type of Care], \"QI\", Table131518710132225[Duration]), 0))))  > 90, SUMIFS($G$13:G29, $D$13:D29,\"Direct/Indirect/Clinical Administration\",  $B$13:B29,\"<=\"&$D$10 + 14)+ ((IF(SUMIF(Table131518710132225[Type of Care], \"QI\", Table131518710132225[Duration])>= 4, 4,IF(SUMIF(Table131518710132225[Type of Care], \"QI\", Table131518710132225[Duration])<= 3, SUMIF(Table131518710132225[Type of Care], \"QI\", Table131518710132225[Duration]), 0))))> 90)","v":false}]
[null,null,"",null,null,null,null,{"$f":"IF( B30 > $D$10+14, SUMIFS($G$13:G30, $D$13:D30,\"Direct/Indirect/Clinical Administration\", $B$13:B30,\">\"&$D$10 + 14) + ((IF(SUMIF(Table131518710132225[Type of Care], \"QI\", Table131518710132225[Duration])>= 4, 4,IF(SUMIF(Table131518710132225[Type of Care], \"QI\", Table131518710132225[Duration])<= 3, SUMIF(Table131518710132225[Type of Care], \"QI\", Table131518710132225[Duration]), 0))))  > 90, SUMIFS($G$13:G30, $D$13:D30,\"Direct/Indirect/Clinical Administration\",  $B$13:B30,\"<=\"&$D$10 + 14)+ ((IF(SUMIF(Table131518710132225[Type of Care], \"QI\", Table131518710132225[Duration])>= 4, 4,IF(SUMIF(Table131518710132225[Type of Care], \"QI\", Table131518710132225[Duration])<= 3, SUMIF(Table131518710132225[Type of Care], \"QI\", Table131518710132225[Duration]), 0))))> 90)","v":false}]
[null,null,"",null,null,null,null,{"$f":"IF( B31 > $D$10+14, SUMIFS($G$13:G31, $D$13:D31,\"Direct/Indirect/Clinical Administration\", $B$13:B31,\">\"&$D$10 + 14) + ((IF(SUMIF(Table131518710132225[Type of Care], \"QI\", Table131518710132225[Duration])>= 4, 4,IF(SUMIF(Table131518710132225[Type of Care], \"QI\", Table131518710132225[Duration])<= 3, SUMIF(Table131518710132225[Type of Care], \"QI\", Table131518710132225[Duration]), 0))))  > 90, SUMIFS($G$13:G31, $D$13:D31,\"Direct/Indirect/Clinical Administration\",  $B$13:B31,\"<=\"&$D$10 + 14)+ ((IF(SUMIF(Table131518710132225[Type of Care], \"QI\", Table131518710132225[Duration])>= 4, 4,IF(SUMIF(Table131518710132225[Type of Care], \"QI\", Table131518710132225[Duration])<= 3, SUMIF(Table131518710132225[Type of Care], \"QI\", Table131518710132225[Duration]), 0))))> 90)","v":false}]
[null,null,"",null,null,null,null,{"$f":"IF( B32 > $D$10+14, SUMIFS($G$13:G32, $D$13:D32,\"Direct/Indirect/Clinical Administration\", $B$13:B32,\">\"&$D$10 + 14) + ((IF(SUMIF(Table131518710132225[Type of Care], \"QI\", Table131518710132225[Duration])>= 4, 4,IF(SUMIF(Table131518710132225[Type of Care], \"QI\", Table131518710132225[Duration])<= 3, SUMIF(Table131518710132225[Type of Care], \"QI\", Table131518710132225[Duration]), 0))))  > 90, SUMIFS($G$13:G32, $D$13:D32,\"Direct/Indirect/Clinical Administration\",  $B$13:B32,\"<=\"&$D$10 + 14)+ ((IF(SUMIF(Table131518710132225[Type of Care], \"QI\", Table131518710132225[Duration])>= 4, 4,IF(SUMIF(Table131518710132225[Type of Care], \"QI\", Table131518710132225[Duration])<= 3, SUMIF(Table131518710132225[Type of Care], \"QI\", Table131518710132225[Duration]), 0))))> 90)","v":false}]
[null,null,"",null,null,null,null,{"$f":"IF( B33 > $D$10+14, SUMIFS($G$13:G33, $D$13:D33,\"Direct/Indirect/Clinical Administration\", $B$13:B33,\">\"&$D$10 + 14) + ((IF(SUMIF(Table131518710132225[Type of Care], \"QI\", Table131518710132225[Duration])>= 4, 4,IF(SUMIF(Table131518710132225[Type of Care], \"QI\", Table131518710132225[Duration])<= 3, SUMIF(Table131518710132225[Type of Care], \"QI\", Table131518710132225[Duration]), 0))))  > 90, SUMIFS($G$13:G33, $D$13:D33,\"Direct/Indirect/Clinical Administration\",  $B$13:B33,\"<=\"&$D$10 + 14)+ ((IF(SUMIF(Table131518710132225[Type of Care], \"QI\", Table131518710132225[Duration])>= 4, 4,IF(SUMIF(Table131518710132225[Type of Care], \"QI\", Table131518710132225[Duration])<= 3, SUMIF(Table131518710132225[Type of Care], \"QI\", Table131518710132225[Duration]), 0))))> 90)","v":false}]
[null,null,"",null,null,null,null,{"$f":"IF( B34 > $D$10+14, SUMIFS($G$13:G34, $D$13:D34,\"Direct/Indirect/Clinical Administration\", $B$13:B34,\">\"&$D$10 + 14) + ((IF(SUMIF(Table131518710132225[Type of Care], \"QI\", Table131518710132225[Duration])>= 4, 4,IF(SUMIF(Table131518710132225[Type of Care], \"QI\", Table131518710132225[Duration])<= 3, SUMIF(Table131518710132225[Type of Care], \"QI\", Table131518710132225[Duration]), 0))))  > 90, SUMIFS($G$13:G34, $D$13:D34,\"Direct/Indirect/Clinical Administration\",  $B$13:B34,\"<=\"&$D$10 + 14)+ ((IF(SUMIF(Table131518710132225[Type of Care], \"QI\", Table131518710132225[Duration])>= 4, 4,IF(SUMIF(Table131518710132225[Type of Care], \"QI\", Table131518710132225[Duration])<= 3, SUMIF(Table131518710132225[Type of Care], \"QI\", Table131518710132225[Duration]), 0))))> 90)","v":false}]
[null,null,{"$f":"IF(B35=\"\", \"\", B35)","v":""},null,null,"Total Contract Hours",{"$f":"(SUMIF(Table131518710132225[Type of Care], \"Direct/Indirect/Clinical Administration\",Table131518710132225[Duration]))","v":0},"CT1"]
[null,null,null,null,null,"Total Included QI Hours",{"$f":"(IF(SUMIF(Table131518710132225[Type of Care], \"QI\", Table131518710132225[Duration])>= 4, 4,IF(SUMIF(Table131518710132225[Type of Care], \"QI\", Table131518710132225[Duration])<= 3, SUMIF(Table131518710132225[Type of Care], \"QI\", Table131518710132225[Duration]), 0)))","v":0},"QI1"]
[null,null,null,null,null,"Total Excluded Hours",{"$f":"G38+G39","v":0},"EX1"]
[null,null,null,null,null,"         Excluded Contract Hours",{"$f":"(SUMIF(Table131518710132225[Type of Care], \"Third Party/Specialist FFS\",Table131518710132225[Duration])) + (SUMIF(Table131518710132225[Type of Care], \"Break (>15 Minutes)\", Table131518710132225[Duration]))","v":0},"EXC1"]
[null,null,null,null,null,"      Excluded QI Hours",{"$f":"(SUMIF(Table131518710132225[Type of Care], \"QI\", Table131518710132225[Duration]) - (IF(SUMIF(Table131518710132225[Type of Care], \"QI\", Table131518710132225[Duration])>= 4, 4,IF(SUMIF(Table131518710132225[Type of Care], \"QI\", Table131518710132225[Duration])<= 3, SUMIF(Table131518710132225[Type of Care], \"QI\", Table131518710132225[Duration]), 0))))","v":0},"EXQI1"]
[null,null,{"$f":"IF(B40=\"\", \"\", B40)","v":""},null,null,"Hours Above 90hr/semi-monthly",{"$f":"  (IF(SUMIFS(Table131518710132225[Duration],Table131518710132225[Date (YYYY-MM-DD)], \">\"&$D$10+14, Table131518710132225[Type of Care], \"Direct/Indirect/Clinical Administration\")>= 90, (SUMIFS(Table131518710132225[Duration],Table131518710132225[Date (YYYY-MM-DD)], \">\"&$D$10+14, Table131518710132225[Type of Care], \"Direct/Indirect/Clinical Administration\")+ (IF(SUMIF(Table131518710132225[Type of Care], \"QI\", Table131518710132225[Duration])>= 4, 4,IF(SUMIF(Table131518710132225[Type of Care], \"QI\", Table131518710132225[Duration])<= 3, SUMIF(Table131518710132225[Type of Care], \"QI\", Table131518710132225[Duration]), 0))) -90))) + (IF(SUMIFS(Table131518710132225[Duration],Table131518710132225[Date (YYYY-MM-DD)], \"<=\"&$D$10+14, Table131518710132225[Type of Care], \"Direct/Indirect/Clinical Administration\")>= 90, (SUMIFS(Table131518710132225[Duration],Table131518710132225[Date (YYYY-MM-DD)], \"<=\"&$D$10+14, Table131518710132225[Type of Care], \"Direct/Indirect/Clinical Administration\")+ (IF(SUMIF(Table131518710132225[Type of Care], \"QI\", Table131518710132225[Duration])>= 4, 4,IF(SUMIF(Table131518710132225[Type of Care], \"QI\", Table131518710132225[Duration])<= 3, SUMIF(Table131518710132225[Type of Care], \"QI\", Table131518710132225[Duration]), 0))) -90)))","v":0},"A901"]
[]
[]
[null,{"$f":"IF(Clinic!C5=\"Jan - Mar\", \"February\", IF(Clinic!C5= \"Apr - June\", \"May\", IF(Clinic!C5=\"July - Sept\", \"August\", IF(Clinic!C5=\" Oct - Dec\", \"November\"))))","v":"February"},{"$f":"Clinic!C6","v":2021},{"$f":"DATE(YEAR(B46),MONTH(DATEVALUE(B43&\"1\")),1)","v":"1900-02-01"},null,null,null,"Month2"]
[]
[null,"Date (YYYY-MM-DD)","Day ","Type of Care","Start Time AM/PM","End Time AM/PM","Duration","FALSE/TRUE"]
[null,null,{"$f":"IF(B46=\"\", \"\", B46)","v":""},null,null,null,null,{"$f":"IF( B46 > $D$43+14, SUMIFS($G$46:G46, $D$46:D46,\"Direct/Indirect/Clinical Administration\", $B$46:B46,\">\"&$D$43 + 14) + ((IF(SUMIF(Table1321619811142326[Type of Care], \"QI\", Table1321619811142326[Duration])>= 4, 4,IF(SUMIF(Table1321619811142326[Type of Care], \"QI\", Table1321619811142326[Duration])<= 3, SUMIF(Table1321619811142326[Type of Care], \"QI\", Table1321619811142326[Duration]), 0))))  > 90, SUMIFS($G$46:G46, $D$46:D46,\"Direct/Indirect/Clinical Administration\",  $B$46:B46,\"<=\"&$D$43 + 14)+ ((IF(SUMIF(Table1321619811142326[Type of Care], \"QI\", Table1321619811142326[Duration])>= 4, 4,IF(SUMIF(Table1321619811142326[Type of Care], \"QI\", Table1321619811142326[Duration])<= 3, SUMIF(Table1321619811142326[Type of Care], \"QI\", Table1321619811142326[Duration]), 0))))> 90)","v":false}]
[null,null,{"$f":"IF(B47=\"\", \"\", B47)","v":""},null,null,null,null,{"$f":"IF( B47 > $D$43+14, SUMIFS($G$46:G47, $D$46:D47,\"Direct/Indirect/Clinical Administration\", $B$46:B47,\">\"&$D$43 + 14) + ((IF(SUMIF(Table1321619811142326[Type of Care], \"QI\", Table1321619811142326[Duration])>= 4, 4,IF(SUMIF(Table1321619811142326[Type of Care], \"QI\", Table1321619811142326[Duration])<= 3, SUMIF(Table1321619811142326[Type of Care], \"QI\", Table1321619811142326[Duration]), 0))))  > 90, SUMIFS($G$46:G47, $D$46:D47,\"Direct/Indirect/Clinical Administration\",  $B$46:B47,\"<=\"&$D$43 + 14)+ ((IF(SUMIF(Table1321619811142326[Type of Care], \"QI\", Table1321619811142326[Duration])>= 4, 4,IF(SUMIF(Table1321619811142326[Type of Care], \"QI\", Table1321619811142326[Duration])<= 3, SUMIF(Table1321619811142326[Type of Care], \"QI\", Table1321619811142326[Duration]), 0))))> 90)","v":false}]
[null,null,"",null,null,null,null,{"$f":"IF( B48 > $D$43+14, SUMIFS($G$46:G48, $D$46:D48,\"Direct/Indirect/Clinical Administration\", $B$46:B48,\">\"&$D$43 + 14) + ((IF(SUMIF(Table1321619811142326[Type of Care], \"QI\", Table1321619811142326[Duration])>= 4, 4,IF(SUMIF(Table1321619811142326[Type of Care], \"QI\", Table1321619811142326[Duration])<= 3, SUMIF(Table1321619811142326[Type of Care], \"QI\", Table1321619811142326[Duration]), 0))))  > 90, SUMIFS($G$46:G48, $D$46:D48,\"Direct/Indirect/Clinical Administration\",  $B$46:B48,\"<=\"&$D$43 + 14)+ ((IF(SUMIF(Table1321619811142326[Type of Care], \"QI\", Table1321619811142326[Duration])>= 4, 4,IF(SUMIF(Table1321619811142326[Type of Care], \"QI\", Table1321619811142326[Duration])<= 3, SUMIF(Table1321619811142326[Type of Care], \"QI\", Table1321619811142326[Duration]), 0))))> 90)","v":false}]
[null,null,"",null,null,null,null,{"$f":"IF( B49 > $D$43+14, SUMIFS($G$46:G49, $D$46:D49,\"Direct/Indirect/Clinical Administration\", $B$46:B49,\">\"&$D$43 + 14) + ((IF(SUMIF(Table1321619811142326[Type of Care], \"QI\", Table1321619811142326[Duration])>= 4, 4,IF(SUMIF(Table1321619811142326[Type of Care], \"QI\", Table1321619811142326[Duration])<= 3, SUMIF(Table1321619811142326[Type of Care], \"QI\", Table1321619811142326[Duration]), 0))))  > 90, SUMIFS($G$46:G49, $D$46:D49,\"Direct/Indirect/Clinical Administration\",  $B$46:B49,\"<=\"&$D$43 + 14)+ ((IF(SUMIF(Table1321619811142326[Type of Care], \"QI\", Table1321619811142326[Duration])>= 4, 4,IF(SUMIF(Table1321619811142326[Type of Care], \"QI\", Table1321619811142326[Duration])<= 3, SUMIF(Table1321619811142326[Type of Care], \"QI\", Table1321619811142326[Duration]), 0))))> 90)","v":false}]
[null,null,"",null,null,null,null,{"$f":"IF( B50 > $D$43+14, SUMIFS($G$46:G50, $D$46:D50,\"Direct/Indirect/Clinical Administration\", $B$46:B50,\">\"&$D$43 + 14) + ((IF(SUMIF(Table1321619811142326[Type of Care], \"QI\", Table1321619811142326[Duration])>= 4, 4,IF(SUMIF(Table1321619811142326[Type of Care], \"QI\", Table1321619811142326[Duration])<= 3, SUMIF(Table1321619811142326[Type of Care], \"QI\", Table1321619811142326[Duration]), 0))))  > 90, SUMIFS($G$46:G50, $D$46:D50,\"Direct/Indirect/Clinical Administration\",  $B$46:B50,\"<=\"&$D$43 + 14)+ ((IF(SUMIF(Table1321619811142326[Type of Care], \"QI\", Table1321619811142326[Duration])>= 4, 4,IF(SUMIF(Table1321619811142326[Type of Care], \"QI\", Table1321619811142326[Duration])<= 3, SUMIF(Table1321619811142326[Type of Care], \"QI\", Table1321619811142326[Duration]), 0))))> 90)","v":false}]
[null,null,"",null,null,null,null,{"$f":"IF( B51 > $D$43+14, SUMIFS($G$46:G51, $D$46:D51,\"Direct/Indirect/Clinical Administration\", $B$46:B51,\">\"&$D$43 + 14) + ((IF(SUMIF(Table1321619811142326[Type of Care], \"QI\", Table1321619811142326[Duration])>= 4, 4,IF(SUMIF(Table1321619811142326[Type of Care], \"QI\", Table1321619811142326[Duration])<= 3, SUMIF(Table1321619811142326[Type of Care], \"QI\", Table1321619811142326[Duration]), 0))))  > 90, SUMIFS($G$46:G51, $D$46:D51,\"Direct/Indirect/Clinical Administration\",  $B$46:B51,\"<=\"&$D$43 + 14)+ ((IF(SUMIF(Table1321619811142326[Type of Care], \"QI\", Table1321619811142326[Duration])>= 4, 4,IF(SUMIF(Table1321619811142326[Type of Care], \"QI\", Table1321619811142326[Duration])<= 3, SUMIF(Table1321619811142326[Type of Care], \"QI\", Table1321619811142326[Duration]), 0))))> 90)","v":false}]
[null,null,"",null,null,null,null,{"$f":"IF( B52 > $D$43+14, SUMIFS($G$46:G52, $D$46:D52,\"Direct/Indirect/Clinical Administration\", $B$46:B52,\">\"&$D$43 + 14) + ((IF(SUMIF(Table1321619811142326[Type of Care], \"QI\", Table1321619811142326[Duration])>= 4, 4,IF(SUMIF(Table1321619811142326[Type of Care], \"QI\", Table1321619811142326[Duration])<= 3, SUMIF(Table1321619811142326[Type of Care], \"QI\", Table1321619811142326[Duration]), 0))))  > 90, SUMIFS($G$46:G52, $D$46:D52,\"Direct/Indirect/Clinical Administration\",  $B$46:B52,\"<=\"&$D$43 + 14)+ ((IF(SUMIF(Table1321619811142326[Type of Care], \"QI\", Table1321619811142326[Duration])>= 4, 4,IF(SUMIF(Table1321619811142326[Type of Care], \"QI\", Table1321619811142326[Duration])<= 3, SUMIF(Table1321619811142326[Type of Care], \"QI\", Table1321619811142326[Duration]), 0))))> 90)","v":false}]
[null,null,"",null,null,null,null,{"$f":"IF( B53 > $D$43+14, SUMIFS($G$46:G53, $D$46:D53,\"Direct/Indirect/Clinical Administration\", $B$46:B53,\">\"&$D$43 + 14) + ((IF(SUMIF(Table1321619811142326[Type of Care], \"QI\", Table1321619811142326[Duration])>= 4, 4,IF(SUMIF(Table1321619811142326[Type of Care], \"QI\", Table1321619811142326[Duration])<= 3, SUMIF(Table1321619811142326[Type of Care], \"QI\", Table1321619811142326[Duration]), 0))))  > 90, SUMIFS($G$46:G53, $D$46:D53,\"Direct/Indirect/Clinical Administration\",  $B$46:B53,\"<=\"&$D$43 + 14)+ ((IF(SUMIF(Table1321619811142326[Type of Care], \"QI\", Table1321619811142326[Duration])>= 4, 4,IF(SUMIF(Table1321619811142326[Type of Care], \"QI\", Table1321619811142326[Duration])<= 3, SUMIF(Table1321619811142326[Type of Care], \"QI\", Table1321619811142326[Duration]), 0))))> 90)","v":false}]
[null,null,"",null,null,null,null,{"$f":"IF( B54 > $D$43+14, SUMIFS($G$46:G54, $D$46:D54,\"Direct/Indirect/Clinical Administration\", $B$46:B54,\">\"&$D$43 + 14) + ((IF(SUMIF(Table1321619811142326[Type of Care], \"QI\", Table1321619811142326[Duration])>= 4, 4,IF(SUMIF(Table1321619811142326[Type of Care], \"QI\", Table1321619811142326[Duration])<= 3, SUMIF(Table1321619811142326[Type of Care], \"QI\", Table1321619811142326[Duration]), 0))))  > 90, SUMIFS($G$46:G54, $D$46:D54,\"Direct/Indirect/Clinical Administration\",  $B$46:B54,\"<=\"&$D$43 + 14)+ ((IF(SUMIF(Table1321619811142326[Type of Care], \"QI\", Table1321619811142326[Duration])>= 4, 4,IF(SUMIF(Table1321619811142326[Type of Care], \"QI\", Table1321619811142326[Duration])<= 3, SUMIF(Table1321619811142326[Type of Care], \"QI\", Table1321619811142326[Duration]), 0))))> 90)","v":false}]
[null,null,"",null,null,null,null,{"$f":"IF( B55 > $D$43+14, SUMIFS($G$46:G55, $D$46:D55,\"Direct/Indirect/Clinical Administration\", $B$46:B55,\">\"&$D$43 + 14) + ((IF(SUMIF(Table1321619811142326[Type of Care], \"QI\", Table1321619811142326[Duration])>= 4, 4,IF(SUMIF(Table1321619811142326[Type of Care], \"QI\", Table1321619811142326[Duration])<= 3, SUMIF(Table1321619811142326[Type of Care], \"QI\", Table1321619811142326[Duration]), 0))))  > 90, SUMIFS($G$46:G55, $D$46:D55,\"Direct/Indirect/Clinical Administration\",  $B$46:B55,\"<=\"&$D$43 + 14)+ ((IF(SUMIF(Table1321619811142326[Type of Care], \"QI\", Table1321619811142326[Duration])>= 4, 4,IF(SUMIF(Table1321619811142326[Type of Care], \"QI\", Table1321619811142326[Duration])<= 3, SUMIF(Table1321619811142326[Type of Care], \"QI\", Table1321619811142326[Duration]), 0))))> 90)","v":false}]
[null,null,"",null,null,null,null,{"$f":"IF( B56 > $D$43+14, SUMIFS($G$46:G56, $D$46:D56,\"Direct/Indirect/Clinical Administration\", $B$46:B56,\">\"&$D$43 + 14) + ((IF(SUMIF(Table1321619811142326[Type of Care], \"QI\", Table1321619811142326[Duration])>= 4, 4,IF(SUMIF(Table1321619811142326[Type of Care], \"QI\", Table1321619811142326[Duration])<= 3, SUMIF(Table1321619811142326[Type of Care], \"QI\", Table1321619811142326[Duration]), 0))))  > 90, SUMIFS($G$46:G56, $D$46:D56,\"Direct/Indirect/Clinical Administration\",  $B$46:B56,\"<=\"&$D$43 + 14)+ ((IF(SUMIF(Table1321619811142326[Type of Care], \"QI\", Table1321619811142326[Duration])>= 4, 4,IF(SUMIF(Table1321619811142326[Type of Care], \"QI\", Table1321619811142326[Duration])<= 3, SUMIF(Table1321619811142326[Type of Care], \"QI\", Table1321619811142326[Duration]), 0))))> 90)","v":false}]
[null,null,"",null,null,null,null,{"$f":"IF( B57 > $D$43+14, SUMIFS($G$46:G57, $D$46:D57,\"Direct/Indirect/Clinical Administration\", $B$46:B57,\">\"&$D$43 + 14) + ((IF(SUMIF(Table1321619811142326[Type of Care], \"QI\", Table1321619811142326[Duration])>= 4, 4,IF(SUMIF(Table1321619811142326[Type of Care], \"QI\", Table1321619811142326[Duration])<= 3, SUMIF(Table1321619811142326[Type of Care], \"QI\", Table1321619811142326[Duration]), 0))))  > 90, SUMIFS($G$46:G57, $D$46:D57,\"Direct/Indirect/Clinical Administration\",  $B$46:B57,\"<=\"&$D$43 + 14)+ ((IF(SUMIF(Table1321619811142326[Type of Care], \"QI\", Table1321619811142326[Duration])>= 4, 4,IF(SUMIF(Table1321619811142326[Type of Care], \"QI\", Table1321619811142326[Duration])<= 3, SUMIF(Table1321619811142326[Type of Care], \"QI\", Table1321619811142326[Duration]), 0))))> 90)","v":false}]
[null,null,"",null,null,null,null,{"$f":"IF( B58 > $D$43+14, SUMIFS($G$46:G58, $D$46:D58,\"Direct/Indirect/Clinical Administration\", $B$46:B58,\">\"&$D$43 + 14) + ((IF(SUMIF(Table1321619811142326[Type of Care], \"QI\", Table1321619811142326[Duration])>= 4, 4,IF(SUMIF(Table1321619811142326[Type of Care], \"QI\", Table1321619811142326[Duration])<= 3, SUMIF(Table1321619811142326[Type of Care], \"QI\", Table1321619811142326[Duration]), 0))))  > 90, SUMIFS($G$46:G58, $D$46:D58,\"Direct/Indirect/Clinical Administration\",  $B$46:B58,\"<=\"&$D$43 + 14)+ ((IF(SUMIF(Table1321619811142326[Type of Care], \"QI\", Table1321619811142326[Duration])>= 4, 4,IF(SUMIF(Table1321619811142326[Type of Care], \"QI\", Table1321619811142326[Duration])<= 3, SUMIF(Table1321619811142326[Type of Care], \"QI\", Table1321619811142326[Duration]), 0))))> 90)","v":false}]
[null,null,"",null,null,null,null,{"$f":"IF( B59 > $D$43+14, SUMIFS($G$46:G59, $D$46:D59,\"Direct/Indirect/Clinical Administration\", $B$46:B59,\">\"&$D$43 + 14) + ((IF(SUMIF(Table1321619811142326[Type of Care], \"QI\", Table1321619811142326[Duration])>= 4, 4,IF(SUMIF(Table1321619811142326[Type of Care], \"QI\", Table1321619811142326[Duration])<= 3, SUMIF(Table1321619811142326[Type of Care], \"QI\", Table1321619811142326[Duration]), 0))))  > 90, SUMIFS($G$46:G59, $D$46:D59,\"Direct/Indirect/Clinical Administration\",  $B$46:B59,\"<=\"&$D$43 + 14)+ ((IF(SUMIF(Table1321619811142326[Type of Care], \"QI\", Table1321619811142326[Duration])>= 4, 4,IF(SUMIF(Table1321619811142326[Type of Care], \"QI\", Table1321619811142326[Duration])<= 3, SUMIF(Table1321619811142326[Type of Care], \"QI\", Table1321619811142326[Duration]), 0))))> 90)","v":false}]
[null,null,"",null,null,null,null,{"$f":"IF( B60 > $D$43+14, SUMIFS($G$46:G60, $D$46:D60,\"Direct/Indirect/Clinical Administration\", $B$46:B60,\">\"&$D$43 + 14) + ((IF(SUMIF(Table1321619811142326[Type of Care], \"QI\", Table1321619811142326[Duration])>= 4, 4,IF(SUMIF(Table1321619811142326[Type of Care], \"QI\", Table1321619811142326[Duration])<= 3, SUMIF(Table1321619811142326[Type of Care], \"QI\", Table1321619811142326[Duration]), 0))))  > 90, SUMIFS($G$46:G60, $D$46:D60,\"Direct/Indirect/Clinical Administration\",  $B$46:B60,\"<=\"&$D$43 + 14)+ ((IF(SUMIF(Table1321619811142326[Type of Care], \"QI\", Table1321619811142326[Duration])>= 4, 4,IF(SUMIF(Table1321619811142326[Type of Care], \"QI\", Table1321619811142326[Duration])<= 3, SUMIF(Table1321619811142326[Type of Care], \"QI\", Table1321619811142326[Duration]), 0))))> 90)","v":false}]
[null,null,"",null,null,null,null,{"$f":"IF( B61 > $D$43+14, SUMIFS($G$46:G61, $D$46:D61,\"Direct/Indirect/Clinical Administration\", $B$46:B61,\">\"&$D$43 + 14) + ((IF(SUMIF(Table1321619811142326[Type of Care], \"QI\", Table1321619811142326[Duration])>= 4, 4,IF(SUMIF(Table1321619811142326[Type of Care], \"QI\", Table1321619811142326[Duration])<= 3, SUMIF(Table1321619811142326[Type of Care], \"QI\", Table1321619811142326[Duration]), 0))))  > 90, SUMIFS($G$46:G61, $D$46:D61,\"Direct/Indirect/Clinical Administration\",  $B$46:B61,\"<=\"&$D$43 + 14)+ ((IF(SUMIF(Table1321619811142326[Type of Care], \"QI\", Table1321619811142326[Duration])>= 4, 4,IF(SUMIF(Table1321619811142326[Type of Care], \"QI\", Table1321619811142326[Duration])<= 3, SUMIF(Table1321619811142326[Type of Care], \"QI\", Table1321619811142326[Duration]), 0))))> 90)","v":false}]
[null,null,"",null,null,null,null,{"$f":"IF( B62 > $D$43+14, SUMIFS($G$46:G62, $D$46:D62,\"Direct/Indirect/Clinical Administration\", $B$46:B62,\">\"&$D$43 + 14) + ((IF(SUMIF(Table1321619811142326[Type of Care], \"QI\", Table1321619811142326[Duration])>= 4, 4,IF(SUMIF(Table1321619811142326[Type of Care], \"QI\", Table1321619811142326[Duration])<= 3, SUMIF(Table1321619811142326[Type of Care], \"QI\", Table1321619811142326[Duration]), 0))))  > 90, SUMIFS($G$46:G62, $D$46:D62,\"Direct/Indirect/Clinical Administration\",  $B$46:B62,\"<=\"&$D$43 + 14)+ ((IF(SUMIF(Table1321619811142326[Type of Care], \"QI\", Table1321619811142326[Duration])>= 4, 4,IF(SUMIF(Table1321619811142326[Type of Care], \"QI\", Table1321619811142326[Duration])<= 3, SUMIF(Table1321619811142326[Type of Care], \"QI\", Table1321619811142326[Duration]), 0))))> 90)","v":false}]
[null,null,"",null,null,null,null,{"$f":"IF( B63 > $D$43+14, SUMIFS($G$46:G63, $D$46:D63,\"Direct/Indirect/Clinical Administration\", $B$46:B63,\">\"&$D$43 + 14) + ((IF(SUMIF(Table1321619811142326[Type of Care], \"QI\", Table1321619811142326[Duration])>= 4, 4,IF(SUMIF(Table1321619811142326[Type of Care], \"QI\", Table1321619811142326[Duration])<= 3, SUMIF(Table1321619811142326[Type of Care], \"QI\", Table1321619811142326[Duration]), 0))))  > 90, SUMIFS($G$46:G63, $D$46:D63,\"Direct/Indirect/Clinical Administration\",  $B$46:B63,\"<=\"&$D$43 + 14)+ ((IF(SUMIF(Table1321619811142326[Type of Care], \"QI\", Table1321619811142326[Duration])>= 4, 4,IF(SUMIF(Table1321619811142326[Type of Care], \"QI\", Table1321619811142326[Duration])<= 3, SUMIF(Table1321619811142326[Type of Care], \"QI\", Table1321619811142326[Duration]), 0))))> 90)","v":false}]
[null,null,"",null,null,null,null,{"$f":"IF( B64 > $D$43+14, SUMIFS($G$46:G64, $D$46:D64,\"Direct/Indirect/Clinical Administration\", $B$46:B64,\">\"&$D$43 + 14) + ((IF(SUMIF(Table1321619811142326[Type of Care], \"QI\", Table1321619811142326[Duration])>= 4, 4,IF(SUMIF(Table1321619811142326[Type of Care], \"QI\", Table1321619811142326[Duration])<= 3, SUMIF(Table1321619811142326[Type of Care], \"QI\", Table1321619811142326[Duration]), 0))))  > 90, SUMIFS($G$46:G64, $D$46:D64,\"Direct/Indirect/Clinical Administration\",  $B$46:B64,\"<=\"&$D$43 + 14)+ ((IF(SUMIF(Table1321619811142326[Type of Care], \"QI\", Table1321619811142326[Duration])>= 4, 4,IF(SUMIF(Table1321619811142326[Type of Care], \"QI\", Table1321619811142326[Duration])<= 3, SUMIF(Table1321619811142326[Type of Care], \"QI\", Table1321619811142326[Duration]), 0))))> 90)","v":false}]
[null,null,"",null,null,null,null,{"$f":"IF( B65 > $D$43+14, SUMIFS($G$46:G65, $D$46:D65,\"Direct/Indirect/Clinical Administration\", $B$46:B65,\">\"&$D$43 + 14) + ((IF(SUMIF(Table1321619811142326[Type of Care], \"QI\", Table1321619811142326[Duration])>= 4, 4,IF(SUMIF(Table1321619811142326[Type of Care], \"QI\", Table1321619811142326[Duration])<= 3, SUMIF(Table1321619811142326[Type of Care], \"QI\", Table1321619811142326[Duration]), 0))))  > 90, SUMIFS($G$46:G65, $D$46:D65,\"Direct/Indirect/Clinical Administration\",  $B$46:B65,\"<=\"&$D$43 + 14)+ ((IF(SUMIF(Table1321619811142326[Type of Care], \"QI\", Table1321619811142326[Duration])>= 4, 4,IF(SUMIF(Table1321619811142326[Type of Care], \"QI\", Table1321619811142326[Duration])<= 3, SUMIF(Table1321619811142326[Type of Care], \"QI\", Table1321619811142326[Duration]), 0))))> 90)","v":false}]
[null,null,"",null,null,null,null,{"$f":"IF( B66 > $D$43+14, SUMIFS($G$46:G66, $D$46:D66,\"Direct/Indirect/Clinical Administration\", $B$46:B66,\">\"&$D$43 + 14) + ((IF(SUMIF(Table1321619811142326[Type of Care], \"QI\", Table1321619811142326[Duration])>= 4, 4,IF(SUMIF(Table1321619811142326[Type of Care], \"QI\", Table1321619811142326[Duration])<= 3, SUMIF(Table1321619811142326[Type of Care], \"QI\", Table1321619811142326[Duration]), 0))))  > 90, SUMIFS($G$46:G66, $D$46:D66,\"Direct/Indirect/Clinical Administration\",  $B$46:B66,\"<=\"&$D$43 + 14)+ ((IF(SUMIF(Table1321619811142326[Type of Care], \"QI\", Table1321619811142326[Duration])>= 4, 4,IF(SUMIF(Table1321619811142326[Type of Care], \"QI\", Table1321619811142326[Duration])<= 3, SUMIF(Table1321619811142326[Type of Care], \"QI\", Table1321619811142326[Duration]), 0))))> 90)","v":false}]
[null,null,"",null,null,null,null,{"$f":"IF( B67 > $D$43+14, SUMIFS($G$46:G67, $D$46:D67,\"Direct/Indirect/Clinical Administration\", $B$46:B67,\">\"&$D$43 + 14) + ((IF(SUMIF(Table1321619811142326[Type of Care], \"QI\", Table1321619811142326[Duration])>= 4, 4,IF(SUMIF(Table1321619811142326[Type of Care], \"QI\", Table1321619811142326[Duration])<= 3, SUMIF(Table1321619811142326[Type of Care], \"QI\", Table1321619811142326[Duration]), 0))))  > 90, SUMIFS($G$46:G67, $D$46:D67,\"Direct/Indirect/Clinical Administration\",  $B$46:B67,\"<=\"&$D$43 + 14)+ ((IF(SUMIF(Table1321619811142326[Type of Care], \"QI\", Table1321619811142326[Duration])>= 4, 4,IF(SUMIF(Table1321619811142326[Type of Care], \"QI\", Table1321619811142326[Duration])<= 3, SUMIF(Table1321619811142326[Type of Care], \"QI\", Table1321619811142326[Duration]), 0))))> 90)","v":false}]
[null,null,"",null,null,null,null,{"$f":"IF( B68 > $D$43+14, SUMIFS($G$46:G68, $D$46:D68,\"Direct/Indirect/Clinical Administration\", $B$46:B68,\">\"&$D$43 + 14) + ((IF(SUMIF(Table1321619811142326[Type of Care], \"QI\", Table1321619811142326[Duration])>= 4, 4,IF(SUMIF(Table1321619811142326[Type of Care], \"QI\", Table1321619811142326[Duration])<= 3, SUMIF(Table1321619811142326[Type of Care], \"QI\", Table1321619811142326[Duration]), 0))))  > 90, SUMIFS($G$46:G68, $D$46:D68,\"Direct/Indirect/Clinical Administration\",  $B$46:B68,\"<=\"&$D$43 + 14)+ ((IF(SUMIF(Table1321619811142326[Type of Care], \"QI\", Table1321619811142326[Duration])>= 4, 4,IF(SUMIF(Table1321619811142326[Type of Care], \"QI\", Table1321619811142326[Duration])<= 3, SUMIF(Table1321619811142326[Type of Care], \"QI\", Table1321619811142326[Duration]), 0))))> 90)","v":false}]
[null,null,"",null,null,null,null,{"$f":"IF( B69 > $D$43+14, SUMIFS($G$46:G69, $D$46:D69,\"Direct/Indirect/Clinical Administration\", $B$46:B69,\">\"&$D$43 + 14) + ((IF(SUMIF(Table1321619811142326[Type of Care], \"QI\", Table1321619811142326[Duration])>= 4, 4,IF(SUMIF(Table1321619811142326[Type of Care], \"QI\", Table1321619811142326[Duration])<= 3, SUMIF(Table1321619811142326[Type of Care], \"QI\", Table1321619811142326[Duration]), 0))))  > 90, SUMIFS($G$46:G69, $D$46:D69,\"Direct/Indirect/Clinical Administration\",  $B$46:B69,\"<=\"&$D$43 + 14)+ ((IF(SUMIF(Table1321619811142326[Type of Care], \"QI\", Table1321619811142326[Duration])>= 4, 4,IF(SUMIF(Table1321619811142326[Type of Care], \"QI\", Table1321619811142326[Duration])<= 3, SUMIF(Table1321619811142326[Type of Care], \"QI\", Table1321619811142326[Duration]), 0))))> 90)","v":false}]
[null,null,"",null,null,null,null,{"$f":"IF( B70 > $D$43+14, SUMIFS($G$46:G70, $D$46:D70,\"Direct/Indirect/Clinical Administration\", $B$46:B70,\">\"&$D$43 + 14) + ((IF(SUMIF(Table1321619811142326[Type of Care], \"QI\", Table1321619811142326[Duration])>= 4, 4,IF(SUMIF(Table1321619811142326[Type of Care], \"QI\", Table1321619811142326[Duration])<= 3, SUMIF(Table1321619811142326[Type of Care], \"QI\", Table1321619811142326[Duration]), 0))))  > 90, SUMIFS($G$46:G70, $D$46:D70,\"Direct/Indirect/Clinical Administration\",  $B$46:B70,\"<=\"&$D$43 + 14)+ ((IF(SUMIF(Table1321619811142326[Type of Care], \"QI\", Table1321619811142326[Duration])>= 4, 4,IF(SUMIF(Table1321619811142326[Type of Care], \"QI\", Table1321619811142326[Duration])<= 3, SUMIF(Table1321619811142326[Type of Care], \"QI\", Table1321619811142326[Duration]), 0))))> 90)","v":false}]
[null,null,"",null,null,null,null,{"$f":"IF( B71 > $D$43+14, SUMIFS($G$46:G71, $D$46:D71,\"Direct/Indirect/Clinical Administration\", $B$46:B71,\">\"&$D$43 + 14) + ((IF(SUMIF(Table1321619811142326[Type of Care], \"QI\", Table1321619811142326[Duration])>= 4, 4,IF(SUMIF(Table1321619811142326[Type of Care], \"QI\", Table1321619811142326[Duration])<= 3, SUMIF(Table1321619811142326[Type of Care], \"QI\", Table1321619811142326[Duration]), 0))))  > 90, SUMIFS($G$46:G71, $D$46:D71,\"Direct/Indirect/Clinical Administration\",  $B$46:B71,\"<=\"&$D$43 + 14)+ ((IF(SUMIF(Table1321619811142326[Type of Care], \"QI\", Table1321619811142326[Duration])>= 4, 4,IF(SUMIF(Table1321619811142326[Type of Care], \"QI\", Table1321619811142326[Duration])<= 3, SUMIF(Table1321619811142326[Type of Care], \"QI\", Table1321619811142326[Duration]), 0))))> 90)","v":false}]
[null,null,"",null,null,null,null,{"$f":"IF( B72 > $D$43+14, SUMIFS($G$46:G72, $D$46:D72,\"Direct/Indirect/Clinical Administration\", $B$46:B72,\">\"&$D$43 + 14) + ((IF(SUMIF(Table1321619811142326[Type of Care], \"QI\", Table1321619811142326[Duration])>= 4, 4,IF(SUMIF(Table1321619811142326[Type of Care], \"QI\", Table1321619811142326[Duration])<= 3, SUMIF(Table1321619811142326[Type of Care], \"QI\", Table1321619811142326[Duration]), 0))))  > 90, SUMIFS($G$46:G72, $D$46:D72,\"Direct/Indirect/Clinical Administration\",  $B$46:B72,\"<=\"&$D$43 + 14)+ ((IF(SUMIF(Table1321619811142326[Type of Care], \"QI\", Table1321619811142326[Duration])>= 4, 4,IF(SUMIF(Table1321619811142326[Type of Care], \"QI\", Table1321619811142326[Duration])<= 3, SUMIF(Table1321619811142326[Type of Care], \"QI\", Table1321619811142326[Duration]), 0))))> 90)","v":false}]
[null,null,"",null,null,null,null,{"$f":"IF( B73 > $D$43+14, SUMIFS($G$46:G73, $D$46:D73,\"Direct/Indirect/Clinical Administration\", $B$46:B73,\">\"&$D$43 + 14) + ((IF(SUMIF(Table1321619811142326[Type of Care], \"QI\", Table1321619811142326[Duration])>= 4, 4,IF(SUMIF(Table1321619811142326[Type of Care], \"QI\", Table1321619811142326[Duration])<= 3, SUMIF(Table1321619811142326[Type of Care], \"QI\", Table1321619811142326[Duration]), 0))))  > 90, SUMIFS($G$46:G73, $D$46:D73,\"Direct/Indirect/Clinical Administration\",  $B$46:B73,\"<=\"&$D$43 + 14)+ ((IF(SUMIF(Table1321619811142326[Type of Care], \"QI\", Table1321619811142326[Duration])>= 4, 4,IF(SUMIF(Table1321619811142326[Type of Care], \"QI\", Table1321619811142326[Duration])<= 3, SUMIF(Table1321619811142326[Type of Care], \"QI\", Table1321619811142326[Duration]), 0))))> 90)","v":false}]
[null,null,{"$f":"IF(B74=\"\", \"\", B74)","v":""},null,null,null,null,{"$f":"IF( B74 > $D$43+14, SUMIFS($G$46:G74, $D$46:D74,\"Direct/Indirect/Clinical Administration\", $B$46:B74,\">\"&$D$43 + 14) + ((IF(SUMIF(Table1321619811142326[Type of Care], \"QI\", Table1321619811142326[Duration])>= 4, 4,IF(SUMIF(Table1321619811142326[Type of Care], \"QI\", Table1321619811142326[Duration])<= 3, SUMIF(Table1321619811142326[Type of Care], \"QI\", Table1321619811142326[Duration]), 0))))  > 90, SUMIFS($G$46:G74, $D$46:D74,\"Direct/Indirect/Clinical Administration\",  $B$46:B74,\"<=\"&$D$43 + 14)+ ((IF(SUMIF(Table1321619811142326[Type of Care], \"QI\", Table1321619811142326[Duration])>= 4, 4,IF(SUMIF(Table1321619811142326[Type of Care], \"QI\", Table1321619811142326[Duration])<= 3, SUMIF(Table1321619811142326[Type of Care], \"QI\", Table1321619811142326[Duration]), 0))))> 90)","v":false}]
[null,null,{"$f":"IF(B75=\"\", \"\", B75)","v":""},null,null,"Total Contract Hours",{"$f":"(SUMIF(Table1321619811142326[Type of Care], \"Direct/Indirect/Clinical Administration\",Table1321619811142326[Duration])) + (SUMIF(Table1321619811142326[Type of Care], \"Correction Hours\",Table1321619811142326[Duration]))","v":0},"CT2"]
[null,null,null,null,null,"Total Included QI Hours",{"$f":"(IF(SUMIF(Table1321619811142326[Type of Care], \"QI\", Table1321619811142326[Duration])>= 4, 4,IF(SUMIF(Table1321619811142326[Type of Care], \"QI\", Table1321619811142326[Duration])<= 3, SUMIF(Table1321619811142326[Type of Care], \"QI\", Table1321619811142326[Duration]), 0)))","v":0},"QI2"]
[null,null,null,null,null,"Total Excluded Hours",{"$f":"G78+G79","v":0},"EX2"]
[null,null,null,null,null,"         Excluded Contract Hours",{"$f":"(SUMIF(Table1321619811142326[Type of Care], \"Third Party/Specialist FFS\",Table1321619811142326[Duration])) + (SUMIF(Table1321619811142326[Type of Care], \"Break (>15 Minutes)\", Table1321619811142326[Duration]))","v":0},"EXC2"]
[null,null,null,null,null,"      Excluded QI Hours",{"$f":"(SUMIF(Table1321619811142326[Type of Care], \"QI\", Table1321619811142326[Duration]) - (IF(SUMIF(Table1321619811142326[Type of Care], \"QI\", Table1321619811142326[Duration])>= 4, 4,IF(SUMIF(Table1321619811142326[Type of Care], \"QI\", Table1321619811142326[Duration])<= 3, SUMIF(Table1321619811142326[Type of Care], \"QI\", Table1321619811142326[Duration]), 0))))","v":0},"EXQI2"]
[null,null,{"$f":"IF(B80=\"\", \"\", B80)","v":""},null,null,"Hours Above 90hr/semi-monthly",{"$f":"  (IF(SUMIFS(Table1321619811142326[Duration],Table1321619811142326[Date (YYYY-MM-DD)], \">\"&$D$43+14, Table1321619811142326[Type of Care], \"Direct/Indirect/Clinical Administration\")>= 90, (SUMIFS(Table1321619811142326[Duration],Table1321619811142326[Date (YYYY-MM-DD)], \">\"&$D$43+14, Table1321619811142326[Type of Care], \"Direct/Indirect/Clinical Administration\")+ (IF(SUMIF(Table1321619811142326[Type of Care], \"QI\", Table1321619811142326[Duration])>= 4, 4,IF(SUMIF(Table1321619811142326[Type of Care], \"QI\", Table1321619811142326[Duration])<= 3, SUMIF(Table1321619811142326[Type of Care], \"QI\", Table1321619811142326[Duration]), 0))) -90))) + (IF(SUMIFS(Table1321619811142326[Duration],Table1321619811142326[Date (YYYY-MM-DD)], \"<=\"&$D$43+14, Table1321619811142326[Type of Care], \"Direct/Indirect/Clinical Administration\")>= 90, (SUMIFS(Table1321619811142326[Duration],Table1321619811142326[Date (YYYY-MM-DD)], \"<=\"&$D$43+14, Table1321619811142326[Type of Care], \"Direct/Indirect/Clinical Administration\")+ (IF(SUMIF(Table1321619811142326[Type of Care], \"QI\", Table1321619811142326[Duration])>= 4, 4,IF(SUMIF(Table1321619811142326[Type of Care], \"QI\", Table1321619811142326[Duration])<= 3, SUMIF(Table1321619811142326[Type of Care], \"QI\", Table1321619811142326[Duration]), 0))) -90)))","v":0},"A902"]
[]
[]
[null,{"$f":"IF(Clinic!C5=\"Jan - Mar\", \"March\", IF(Clinic!C5= \"Apr - June\", \"June\", IF(Clinic!C5=\"July - Sept\", \"September\", IF(Clinic!C5=\" Oct - Dec\", \"December\"))))","v":"March"},{"$f":"Clinic!C6","v":2021},{"$f":"DATE(YEAR(B86),MONTH(DATEVALUE(B83&\"1\")),1)","v":"1900-03-01"},null,null,null,"Month3"]
[]
[null,"Date (YYYY-MM-DD)","Day ","Type of Care","Start Time AM/PM","End Time AM/PM","Duration ","FALSE/TRUE"]
[null,null,{"$f":"IF(B86=\"\", \"\", B86)","v":""},null,null,null,null,{"$f":"IF( B86 > $D$83+14, SUMIFS($G$86:G86, $D$86:D86,\"Direct/Indirect/Clinical Administration\", $B$86:B86,\">\"&$D$83 + 14) + ((IF(SUMIF(Table13261720912212427[Type of Care], \"QI\", Table13261720912212427[[Duration ]])>= 4, 4,IF(SUMIF(Table13261720912212427[Type of Care], \"QI\", Table13261720912212427[[Duration ]])<= 3, SUMIF(Table13261720912212427[Type of Care], \"QI\", Table13261720912212427[[Duration ]]), 0))))  > 90, SUMIFS($G$86:G86, $D$86:D86,\"Direct/Indirect/Clinical Administration\",  $B$86:B86,\"<=\"&$D$83 + 14)+ ((IF(SUMIF(Table13261720912212427[Type of Care], \"QI\", Table13261720912212427[[Duration ]])>= 4, 4,IF(SUMIF(Table13261720912212427[Type of Care], \"QI\", Table13261720912212427[[Duration ]])<= 3, SUMIF(Table13261720912212427[Type of Care], \"QI\", Table13261720912212427[[Duration ]]), 0))))> 90)","v":false}]
[null,null,{"$f":"IF(B87=\"\", \"\", B87)","v":""},null,null,null,null,{"$f":"IF( B87 > $D$83+14, SUMIFS($G$86:G87, $D$86:D87,\"Direct/Indirect/Clinical Administration\", $B$86:B87,\">\"&$D$83 + 14) + ((IF(SUMIF(Table13261720912212427[Type of Care], \"QI\", Table13261720912212427[[Duration ]])>= 4, 4,IF(SUMIF(Table13261720912212427[Type of Care], \"QI\", Table13261720912212427[[Duration ]])<= 3, SUMIF(Table13261720912212427[Type of Care], \"QI\", Table13261720912212427[[Duration ]]), 0))))  > 90, SUMIFS($G$86:G87, $D$86:D87,\"Direct/Indirect/Clinical Administration\",  $B$86:B87,\"<=\"&$D$83 + 14)+ ((IF(SUMIF(Table13261720912212427[Type of Care], \"QI\", Table13261720912212427[[Duration ]])>= 4, 4,IF(SUMIF(Table13261720912212427[Type of Care], \"QI\", Table13261720912212427[[Duration ]])<= 3, SUMIF(Table13261720912212427[Type of Care], \"QI\", Table13261720912212427[[Duration ]]), 0))))> 90)","v":false}]
[null,null,"",null,null,null,null,{"$f":"IF( B88 > $D$83+14, SUMIFS($G$86:G88, $D$86:D88,\"Direct/Indirect/Clinical Administration\", $B$86:B88,\">\"&$D$83 + 14) + ((IF(SUMIF(Table13261720912212427[Type of Care], \"QI\", Table13261720912212427[[Duration ]])>= 4, 4,IF(SUMIF(Table13261720912212427[Type of Care], \"QI\", Table13261720912212427[[Duration ]])<= 3, SUMIF(Table13261720912212427[Type of Care], \"QI\", Table13261720912212427[[Duration ]]), 0))))  > 90, SUMIFS($G$86:G88, $D$86:D88,\"Direct/Indirect/Clinical Administration\",  $B$86:B88,\"<=\"&$D$83 + 14)+ ((IF(SUMIF(Table13261720912212427[Type of Care], \"QI\", Table13261720912212427[[Duration ]])>= 4, 4,IF(SUMIF(Table13261720912212427[Type of Care], \"QI\", Table13261720912212427[[Duration ]])<= 3, SUMIF(Table13261720912212427[Type of Care], \"QI\", Table13261720912212427[[Duration ]]), 0))))> 90)","v":false}]
[null,null,"",null,null,null,null,{"$f":"IF( B89 > $D$83+14, SUMIFS($G$86:G89, $D$86:D89,\"Direct/Indirect/Clinical Administration\", $B$86:B89,\">\"&$D$83 + 14) + ((IF(SUMIF(Table13261720912212427[Type of Care], \"QI\", Table13261720912212427[[Duration ]])>= 4, 4,IF(SUMIF(Table13261720912212427[Type of Care], \"QI\", Table13261720912212427[[Duration ]])<= 3, SUMIF(Table13261720912212427[Type of Care], \"QI\", Table13261720912212427[[Duration ]]), 0))))  > 90, SUMIFS($G$86:G89, $D$86:D89,\"Direct/Indirect/Clinical Administration\",  $B$86:B89,\"<=\"&$D$83 + 14)+ ((IF(SUMIF(Table13261720912212427[Type of Care], \"QI\", Table13261720912212427[[Duration ]])>= 4, 4,IF(SUMIF(Table13261720912212427[Type of Care], \"QI\", Table13261720912212427[[Duration ]])<= 3, SUMIF(Table13261720912212427[Type of Care], \"QI\", Table13261720912212427[[Duration ]]), 0))))> 90)","v":false}]
[null,null,"",null,null,null,null,{"$f":"IF( B90 > $D$83+14, SUMIFS($G$86:G90, $D$86:D90,\"Direct/Indirect/Clinical Administration\", $B$86:B90,\">\"&$D$83 + 14) + ((IF(SUMIF(Table13261720912212427[Type of Care], \"QI\", Table13261720912212427[[Duration ]])>= 4, 4,IF(SUMIF(Table13261720912212427[Type of Care], \"QI\", Table13261720912212427[[Duration ]])<= 3, SUMIF(Table13261720912212427[Type of Care], \"QI\", Table13261720912212427[[Duration ]]), 0))))  > 90, SUMIFS($G$86:G90, $D$86:D90,\"Direct/Indirect/Clinical Administration\",  $B$86:B90,\"<=\"&$D$83 + 14)+ ((IF(SUMIF(Table13261720912212427[Type of Care], \"QI\", Table13261720912212427[[Duration ]])>= 4, 4,IF(SUMIF(Table13261720912212427[Type of Care], \"QI\", Table13261720912212427[[Duration ]])<= 3, SUMIF(Table13261720912212427[Type of Care], \"QI\", Table13261720912212427[[Duration ]]), 0))))> 90)","v":false}]
[null,null,"",null,null,null,null,{"$f":"IF( B91 > $D$83+14, SUMIFS($G$86:G91, $D$86:D91,\"Direct/Indirect/Clinical Administration\", $B$86:B91,\">\"&$D$83 + 14) + ((IF(SUMIF(Table13261720912212427[Type of Care], \"QI\", Table13261720912212427[[Duration ]])>= 4, 4,IF(SUMIF(Table13261720912212427[Type of Care], \"QI\", Table13261720912212427[[Duration ]])<= 3, SUMIF(Table13261720912212427[Type of Care], \"QI\", Table13261720912212427[[Duration ]]), 0))))  > 90, SUMIFS($G$86:G91, $D$86:D91,\"Direct/Indirect/Clinical Administration\",  $B$86:B91,\"<=\"&$D$83 + 14)+ ((IF(SUMIF(Table13261720912212427[Type of Care], \"QI\", Table13261720912212427[[Duration ]])>= 4, 4,IF(SUMIF(Table13261720912212427[Type of Care], \"QI\", Table13261720912212427[[Duration ]])<= 3, SUMIF(Table13261720912212427[Type of Care], \"QI\", Table13261720912212427[[Duration ]]), 0))))> 90)","v":false}]
[null,null,"",null,null,null,null,{"$f":"IF( B92 > $D$83+14, SUMIFS($G$86:G92, $D$86:D92,\"Direct/Indirect/Clinical Administration\", $B$86:B92,\">\"&$D$83 + 14) + ((IF(SUMIF(Table13261720912212427[Type of Care], \"QI\", Table13261720912212427[[Duration ]])>= 4, 4,IF(SUMIF(Table13261720912212427[Type of Care], \"QI\", Table13261720912212427[[Duration ]])<= 3, SUMIF(Table13261720912212427[Type of Care], \"QI\", Table13261720912212427[[Duration ]]), 0))))  > 90, SUMIFS($G$86:G92, $D$86:D92,\"Direct/Indirect/Clinical Administration\",  $B$86:B92,\"<=\"&$D$83 + 14)+ ((IF(SUMIF(Table13261720912212427[Type of Care], \"QI\", Table13261720912212427[[Duration ]])>= 4, 4,IF(SUMIF(Table13261720912212427[Type of Care], \"QI\", Table13261720912212427[[Duration ]])<= 3, SUMIF(Table13261720912212427[Type of Care], \"QI\", Table13261720912212427[[Duration ]]), 0))))> 90)","v":false}]
[null,null,"",null,null,null,null,{"$f":"IF( B93 > $D$83+14, SUMIFS($G$86:G93, $D$86:D93,\"Direct/Indirect/Clinical Administration\", $B$86:B93,\">\"&$D$83 + 14) + ((IF(SUMIF(Table13261720912212427[Type of Care], \"QI\", Table13261720912212427[[Duration ]])>= 4, 4,IF(SUMIF(Table13261720912212427[Type of Care], \"QI\", Table13261720912212427[[Duration ]])<= 3, SUMIF(Table13261720912212427[Type of Care], \"QI\", Table13261720912212427[[Duration ]]), 0))))  > 90, SUMIFS($G$86:G93, $D$86:D93,\"Direct/Indirect/Clinical Administration\",  $B$86:B93,\"<=\"&$D$83 + 14)+ ((IF(SUMIF(Table13261720912212427[Type of Care], \"QI\", Table13261720912212427[[Duration ]])>= 4, 4,IF(SUMIF(Table13261720912212427[Type of Care], \"QI\", Table13261720912212427[[Duration ]])<= 3, SUMIF(Table13261720912212427[Type of Care], \"QI\", Table13261720912212427[[Duration ]]), 0))))> 90)","v":false}]
[null,null,"",null,null,null,null,{"$f":"IF( B94 > $D$83+14, SUMIFS($G$86:G94, $D$86:D94,\"Direct/Indirect/Clinical Administration\", $B$86:B94,\">\"&$D$83 + 14) + ((IF(SUMIF(Table13261720912212427[Type of Care], \"QI\", Table13261720912212427[[Duration ]])>= 4, 4,IF(SUMIF(Table13261720912212427[Type of Care], \"QI\", Table13261720912212427[[Duration ]])<= 3, SUMIF(Table13261720912212427[Type of Care], \"QI\", Table13261720912212427[[Duration ]]), 0))))  > 90, SUMIFS($G$86:G94, $D$86:D94,\"Direct/Indirect/Clinical Administration\",  $B$86:B94,\"<=\"&$D$83 + 14)+ ((IF(SUMIF(Table13261720912212427[Type of Care], \"QI\", Table13261720912212427[[Duration ]])>= 4, 4,IF(SUMIF(Table13261720912212427[Type of Care], \"QI\", Table13261720912212427[[Duration ]])<= 3, SUMIF(Table13261720912212427[Type of Care], \"QI\", Table13261720912212427[[Duration ]]), 0))))> 90)","v":false}]
[null,null,"",null,null,null,null,{"$f":"IF( B95 > $D$83+14, SUMIFS($G$86:G95, $D$86:D95,\"Direct/Indirect/Clinical Administration\", $B$86:B95,\">\"&$D$83 + 14) + ((IF(SUMIF(Table13261720912212427[Type of Care], \"QI\", Table13261720912212427[[Duration ]])>= 4, 4,IF(SUMIF(Table13261720912212427[Type of Care], \"QI\", Table13261720912212427[[Duration ]])<= 3, SUMIF(Table13261720912212427[Type of Care], \"QI\", Table13261720912212427[[Duration ]]), 0))))  > 90, SUMIFS($G$86:G95, $D$86:D95,\"Direct/Indirect/Clinical Administration\",  $B$86:B95,\"<=\"&$D$83 + 14)+ ((IF(SUMIF(Table13261720912212427[Type of Care], \"QI\", Table13261720912212427[[Duration ]])>= 4, 4,IF(SUMIF(Table13261720912212427[Type of Care], \"QI\", Table13261720912212427[[Duration ]])<= 3, SUMIF(Table13261720912212427[Type of Care], \"QI\", Table13261720912212427[[Duration ]]), 0))))> 90)","v":false}]
[null,null,"",null,null,null,null,{"$f":"IF( B96 > $D$83+14, SUMIFS($G$86:G96, $D$86:D96,\"Direct/Indirect/Clinical Administration\", $B$86:B96,\">\"&$D$83 + 14) + ((IF(SUMIF(Table13261720912212427[Type of Care], \"QI\", Table13261720912212427[[Duration ]])>= 4, 4,IF(SUMIF(Table13261720912212427[Type of Care], \"QI\", Table13261720912212427[[Duration ]])<= 3, SUMIF(Table13261720912212427[Type of Care], \"QI\", Table13261720912212427[[Duration ]]), 0))))  > 90, SUMIFS($G$86:G96, $D$86:D96,\"Direct/Indirect/Clinical Administration\",  $B$86:B96,\"<=\"&$D$83 + 14)+ ((IF(SUMIF(Table13261720912212427[Type of Care], \"QI\", Table13261720912212427[[Duration ]])>= 4, 4,IF(SUMIF(Table13261720912212427[Type of Care], \"QI\", Table13261720912212427[[Duration ]])<= 3, SUMIF(Table13261720912212427[Type of Care], \"QI\", Table13261720912212427[[Duration ]]), 0))))> 90)","v":false}]
[null,null,"",null,null,null,null,{"$f":"IF( B97 > $D$83+14, SUMIFS($G$86:G97, $D$86:D97,\"Direct/Indirect/Clinical Administration\", $B$86:B97,\">\"&$D$83 + 14) + ((IF(SUMIF(Table13261720912212427[Type of Care], \"QI\", Table13261720912212427[[Duration ]])>= 4, 4,IF(SUMIF(Table13261720912212427[Type of Care], \"QI\", Table13261720912212427[[Duration ]])<= 3, SUMIF(Table13261720912212427[Type of Care], \"QI\", Table13261720912212427[[Duration ]]), 0))))  > 90, SUMIFS($G$86:G97, $D$86:D97,\"Direct/Indirect/Clinical Administration\",  $B$86:B97,\"<=\"&$D$83 + 14)+ ((IF(SUMIF(Table13261720912212427[Type of Care], \"QI\", Table13261720912212427[[Duration ]])>= 4, 4,IF(SUMIF(Table13261720912212427[Type of Care], \"QI\", Table13261720912212427[[Duration ]])<= 3, SUMIF(Table13261720912212427[Type of Care], \"QI\", Table13261720912212427[[Duration ]]), 0))))> 90)","v":false}]
[null,null,"",null,null,null,null,{"$f":"IF( B98 > $D$83+14, SUMIFS($G$86:G98, $D$86:D98,\"Direct/Indirect/Clinical Administration\", $B$86:B98,\">\"&$D$83 + 14) + ((IF(SUMIF(Table13261720912212427[Type of Care], \"QI\", Table13261720912212427[[Duration ]])>= 4, 4,IF(SUMIF(Table13261720912212427[Type of Care], \"QI\", Table13261720912212427[[Duration ]])<= 3, SUMIF(Table13261720912212427[Type of Care], \"QI\", Table13261720912212427[[Duration ]]), 0))))  > 90, SUMIFS($G$86:G98, $D$86:D98,\"Direct/Indirect/Clinical Administration\",  $B$86:B98,\"<=\"&$D$83 + 14)+ ((IF(SUMIF(Table13261720912212427[Type of Care], \"QI\", Table13261720912212427[[Duration ]])>= 4, 4,IF(SUMIF(Table13261720912212427[Type of Care], \"QI\", Table13261720912212427[[Duration ]])<= 3, SUMIF(Table13261720912212427[Type of Care], \"QI\", Table13261720912212427[[Duration ]]), 0))))> 90)","v":false}]
[null,null,"",null,null,null,null,{"$f":"IF( B99 > $D$83+14, SUMIFS($G$86:G99, $D$86:D99,\"Direct/Indirect/Clinical Administration\", $B$86:B99,\">\"&$D$83 + 14) + ((IF(SUMIF(Table13261720912212427[Type of Care], \"QI\", Table13261720912212427[[Duration ]])>= 4, 4,IF(SUMIF(Table13261720912212427[Type of Care], \"QI\", Table13261720912212427[[Duration ]])<= 3, SUMIF(Table13261720912212427[Type of Care], \"QI\", Table13261720912212427[[Duration ]]), 0))))  > 90, SUMIFS($G$86:G99, $D$86:D99,\"Direct/Indirect/Clinical Administration\",  $B$86:B99,\"<=\"&$D$83 + 14)+ ((IF(SUMIF(Table13261720912212427[Type of Care], \"QI\", Table13261720912212427[[Duration ]])>= 4, 4,IF(SUMIF(Table13261720912212427[Type of Care], \"QI\", Table13261720912212427[[Duration ]])<= 3, SUMIF(Table13261720912212427[Type of Care], \"QI\", Table13261720912212427[[Duration ]]), 0))))> 90)","v":false}]
[null,null,"",null,null,null,null,{"$f":"IF( B100 > $D$83+14, SUMIFS($G$86:G100, $D$86:D100,\"Direct/Indirect/Clinical Administration\", $B$86:B100,\">\"&$D$83 + 14) + ((IF(SUMIF(Table13261720912212427[Type of Care], \"QI\", Table13261720912212427[[Duration ]])>= 4, 4,IF(SUMIF(Table13261720912212427[Type of Care], \"QI\", Table13261720912212427[[Duration ]])<= 3, SUMIF(Table13261720912212427[Type of Care], \"QI\", Table13261720912212427[[Duration ]]), 0))))  > 90, SUMIFS($G$86:G100, $D$86:D100,\"Direct/Indirect/Clinical Administration\",  $B$86:B100,\"<=\"&$D$83 + 14)+ ((IF(SUMIF(Table13261720912212427[Type of Care], \"QI\", Table13261720912212427[[Duration ]])>= 4, 4,IF(SUMIF(Table13261720912212427[Type of Care], \"QI\", Table13261720912212427[[Duration ]])<= 3, SUMIF(Table13261720912212427[Type of Care], \"QI\", Table13261720912212427[[Duration ]]), 0))))> 90)","v":false}]
[null,null,"",null,null,null,null,{"$f":"IF( B101 > $D$83+14, SUMIFS($G$86:G101, $D$86:D101,\"Direct/Indirect/Clinical Administration\", $B$86:B101,\">\"&$D$83 + 14) + ((IF(SUMIF(Table13261720912212427[Type of Care], \"QI\", Table13261720912212427[[Duration ]])>= 4, 4,IF(SUMIF(Table13261720912212427[Type of Care], \"QI\", Table13261720912212427[[Duration ]])<= 3, SUMIF(Table13261720912212427[Type of Care], \"QI\", Table13261720912212427[[Duration ]]), 0))))  > 90, SUMIFS($G$86:G101, $D$86:D101,\"Direct/Indirect/Clinical Administration\",  $B$86:B101,\"<=\"&$D$83 + 14)+ ((IF(SUMIF(Table13261720912212427[Type of Care], \"QI\", Table13261720912212427[[Duration ]])>= 4, 4,IF(SUMIF(Table13261720912212427[Type of Care], \"QI\", Table13261720912212427[[Duration ]])<= 3, SUMIF(Table13261720912212427[Type of Care], \"QI\", Table13261720912212427[[Duration ]]), 0))))> 90)","v":false}]
[null,null,"",null,null,null,null,{"$f":"IF( B102 > $D$83+14, SUMIFS($G$86:G102, $D$86:D102,\"Direct/Indirect/Clinical Administration\", $B$86:B102,\">\"&$D$83 + 14) + ((IF(SUMIF(Table13261720912212427[Type of Care], \"QI\", Table13261720912212427[[Duration ]])>= 4, 4,IF(SUMIF(Table13261720912212427[Type of Care], \"QI\", Table13261720912212427[[Duration ]])<= 3, SUMIF(Table13261720912212427[Type of Care], \"QI\", Table13261720912212427[[Duration ]]), 0))))  > 90, SUMIFS($G$86:G102, $D$86:D102,\"Direct/Indirect/Clinical Administration\",  $B$86:B102,\"<=\"&$D$83 + 14)+ ((IF(SUMIF(Table13261720912212427[Type of Care], \"QI\", Table13261720912212427[[Duration ]])>= 4, 4,IF(SUMIF(Table13261720912212427[Type of Care], \"QI\", Table13261720912212427[[Duration ]])<= 3, SUMIF(Table13261720912212427[Type of Care], \"QI\", Table13261720912212427[[Duration ]]), 0))))> 90)","v":false}]
[null,null,"",null,null,null,null,{"$f":"IF( B103 > $D$83+14, SUMIFS($G$86:G103, $D$86:D103,\"Direct/Indirect/Clinical Administration\", $B$86:B103,\">\"&$D$83 + 14) + ((IF(SUMIF(Table13261720912212427[Type of Care], \"QI\", Table13261720912212427[[Duration ]])>= 4, 4,IF(SUMIF(Table13261720912212427[Type of Care], \"QI\", Table13261720912212427[[Duration ]])<= 3, SUMIF(Table13261720912212427[Type of Care], \"QI\", Table13261720912212427[[Duration ]]), 0))))  > 90, SUMIFS($G$86:G103, $D$86:D103,\"Direct/Indirect/Clinical Administration\",  $B$86:B103,\"<=\"&$D$83 + 14)+ ((IF(SUMIF(Table13261720912212427[Type of Care], \"QI\", Table13261720912212427[[Duration ]])>= 4, 4,IF(SUMIF(Table13261720912212427[Type of Care], \"QI\", Table13261720912212427[[Duration ]])<= 3, SUMIF(Table13261720912212427[Type of Care], \"QI\", Table13261720912212427[[Duration ]]), 0))))> 90)","v":false}]
[null,null,"",null,null,null,null,{"$f":"IF( B104 > $D$83+14, SUMIFS($G$86:G104, $D$86:D104,\"Direct/Indirect/Clinical Administration\", $B$86:B104,\">\"&$D$83 + 14) + ((IF(SUMIF(Table13261720912212427[Type of Care], \"QI\", Table13261720912212427[[Duration ]])>= 4, 4,IF(SUMIF(Table13261720912212427[Type of Care], \"QI\", Table13261720912212427[[Duration ]])<= 3, SUMIF(Table13261720912212427[Type of Care], \"QI\", Table13261720912212427[[Duration ]]), 0))))  > 90, SUMIFS($G$86:G104, $D$86:D104,\"Direct/Indirect/Clinical Administration\",  $B$86:B104,\"<=\"&$D$83 + 14)+ ((IF(SUMIF(Table13261720912212427[Type of Care], \"QI\", Table13261720912212427[[Duration ]])>= 4, 4,IF(SUMIF(Table13261720912212427[Type of Care], \"QI\", Table13261720912212427[[Duration ]])<= 3, SUMIF(Table13261720912212427[Type of Care], \"QI\", Table13261720912212427[[Duration ]]), 0))))> 90)","v":false}]
[null,null,"",null,null,null,null,{"$f":"IF( B105 > $D$83+14, SUMIFS($G$86:G105, $D$86:D105,\"Direct/Indirect/Clinical Administration\", $B$86:B105,\">\"&$D$83 + 14) + ((IF(SUMIF(Table13261720912212427[Type of Care], \"QI\", Table13261720912212427[[Duration ]])>= 4, 4,IF(SUMIF(Table13261720912212427[Type of Care], \"QI\", Table13261720912212427[[Duration ]])<= 3, SUMIF(Table13261720912212427[Type of Care], \"QI\", Table13261720912212427[[Duration ]]), 0))))  > 90, SUMIFS($G$86:G105, $D$86:D105,\"Direct/Indirect/Clinical Administration\",  $B$86:B105,\"<=\"&$D$83 + 14)+ ((IF(SUMIF(Table13261720912212427[Type of Care], \"QI\", Table13261720912212427[[Duration ]])>= 4, 4,IF(SUMIF(Table13261720912212427[Type of Care], \"QI\", Table13261720912212427[[Duration ]])<= 3, SUMIF(Table13261720912212427[Type of Care], \"QI\", Table13261720912212427[[Duration ]]), 0))))> 90)","v":false}]
[null,null,"",null,null,null,null,{"$f":"IF( B106 > $D$83+14, SUMIFS($G$86:G106, $D$86:D106,\"Direct/Indirect/Clinical Administration\", $B$86:B106,\">\"&$D$83 + 14) + ((IF(SUMIF(Table13261720912212427[Type of Care], \"QI\", Table13261720912212427[[Duration ]])>= 4, 4,IF(SUMIF(Table13261720912212427[Type of Care], \"QI\", Table13261720912212427[[Duration ]])<= 3, SUMIF(Table13261720912212427[Type of Care], \"QI\", Table13261720912212427[[Duration ]]), 0))))  > 90, SUMIFS($G$86:G106, $D$86:D106,\"Direct/Indirect/Clinical Administration\",  $B$86:B106,\"<=\"&$D$83 + 14)+ ((IF(SUMIF(Table13261720912212427[Type of Care], \"QI\", Table13261720912212427[[Duration ]])>= 4, 4,IF(SUMIF(Table13261720912212427[Type of Care], \"QI\", Table13261720912212427[[Duration ]])<= 3, SUMIF(Table13261720912212427[Type of Care], \"QI\", Table13261720912212427[[Duration ]]), 0))))> 90)","v":false}]
[null,null,"",null,null,null,null,{"$f":"IF( B107 > $D$83+14, SUMIFS($G$86:G107, $D$86:D107,\"Direct/Indirect/Clinical Administration\", $B$86:B107,\">\"&$D$83 + 14) + ((IF(SUMIF(Table13261720912212427[Type of Care], \"QI\", Table13261720912212427[[Duration ]])>= 4, 4,IF(SUMIF(Table13261720912212427[Type of Care], \"QI\", Table13261720912212427[[Duration ]])<= 3, SUMIF(Table13261720912212427[Type of Care], \"QI\", Table13261720912212427[[Duration ]]), 0))))  > 90, SUMIFS($G$86:G107, $D$86:D107,\"Direct/Indirect/Clinical Administration\",  $B$86:B107,\"<=\"&$D$83 + 14)+ ((IF(SUMIF(Table13261720912212427[Type of Care], \"QI\", Table13261720912212427[[Duration ]])>= 4, 4,IF(SUMIF(Table13261720912212427[Type of Care], \"QI\", Table13261720912212427[[Duration ]])<= 3, SUMIF(Table13261720912212427[Type of Care], \"QI\", Table13261720912212427[[Duration ]]), 0))))> 90)","v":false}]
[null,null,"",null,null,null,null,{"$f":"IF( B108 > $D$83+14, SUMIFS($G$86:G108, $D$86:D108,\"Direct/Indirect/Clinical Administration\", $B$86:B108,\">\"&$D$83 + 14) + ((IF(SUMIF(Table13261720912212427[Type of Care], \"QI\", Table13261720912212427[[Duration ]])>= 4, 4,IF(SUMIF(Table13261720912212427[Type of Care], \"QI\", Table13261720912212427[[Duration ]])<= 3, SUMIF(Table13261720912212427[Type of Care], \"QI\", Table13261720912212427[[Duration ]]), 0))))  > 90, SUMIFS($G$86:G108, $D$86:D108,\"Direct/Indirect/Clinical Administration\",  $B$86:B108,\"<=\"&$D$83 + 14)+ ((IF(SUMIF(Table13261720912212427[Type of Care], \"QI\", Table13261720912212427[[Duration ]])>= 4, 4,IF(SUMIF(Table13261720912212427[Type of Care], \"QI\", Table13261720912212427[[Duration ]])<= 3, SUMIF(Table13261720912212427[Type of Care], \"QI\", Table13261720912212427[[Duration ]]), 0))))> 90)","v":false}]
[null,null,"",null,null,null,null,{"$f":"IF( B109 > $D$83+14, SUMIFS($G$86:G109, $D$86:D109,\"Direct/Indirect/Clinical Administration\", $B$86:B109,\">\"&$D$83 + 14) + ((IF(SUMIF(Table13261720912212427[Type of Care], \"QI\", Table13261720912212427[[Duration ]])>= 4, 4,IF(SUMIF(Table13261720912212427[Type of Care], \"QI\", Table13261720912212427[[Duration ]])<= 3, SUMIF(Table13261720912212427[Type of Care], \"QI\", Table13261720912212427[[Duration ]]), 0))))  > 90, SUMIFS($G$86:G109, $D$86:D109,\"Direct/Indirect/Clinical Administration\",  $B$86:B109,\"<=\"&$D$83 + 14)+ ((IF(SUMIF(Table13261720912212427[Type of Care], \"QI\", Table13261720912212427[[Duration ]])>= 4, 4,IF(SUMIF(Table13261720912212427[Type of Care], \"QI\", Table13261720912212427[[Duration ]])<= 3, SUMIF(Table13261720912212427[Type of Care], \"QI\", Table13261720912212427[[Duration ]]), 0))))> 90)","v":false}]
[null,null,"",null,null,null,null,{"$f":"IF( B110 > $D$83+14, SUMIFS($G$86:G110, $D$86:D110,\"Direct/Indirect/Clinical Administration\", $B$86:B110,\">\"&$D$83 + 14) + ((IF(SUMIF(Table13261720912212427[Type of Care], \"QI\", Table13261720912212427[[Duration ]])>= 4, 4,IF(SUMIF(Table13261720912212427[Type of Care], \"QI\", Table13261720912212427[[Duration ]])<= 3, SUMIF(Table13261720912212427[Type of Care], \"QI\", Table13261720912212427[[Duration ]]), 0))))  > 90, SUMIFS($G$86:G110, $D$86:D110,\"Direct/Indirect/Clinical Administration\",  $B$86:B110,\"<=\"&$D$83 + 14)+ ((IF(SUMIF(Table13261720912212427[Type of Care], \"QI\", Table13261720912212427[[Duration ]])>= 4, 4,IF(SUMIF(Table13261720912212427[Type of Care], \"QI\", Table13261720912212427[[Duration ]])<= 3, SUMIF(Table13261720912212427[Type of Care], \"QI\", Table13261720912212427[[Duration ]]), 0))))> 90)","v":false}]
[null,null,"",null,null,null,null,{"$f":"IF( B111 > $D$83+14, SUMIFS($G$86:G111, $D$86:D111,\"Direct/Indirect/Clinical Administration\", $B$86:B111,\">\"&$D$83 + 14) + ((IF(SUMIF(Table13261720912212427[Type of Care], \"QI\", Table13261720912212427[[Duration ]])>= 4, 4,IF(SUMIF(Table13261720912212427[Type of Care], \"QI\", Table13261720912212427[[Duration ]])<= 3, SUMIF(Table13261720912212427[Type of Care], \"QI\", Table13261720912212427[[Duration ]]), 0))))  > 90, SUMIFS($G$86:G111, $D$86:D111,\"Direct/Indirect/Clinical Administration\",  $B$86:B111,\"<=\"&$D$83 + 14)+ ((IF(SUMIF(Table13261720912212427[Type of Care], \"QI\", Table13261720912212427[[Duration ]])>= 4, 4,IF(SUMIF(Table13261720912212427[Type of Care], \"QI\", Table13261720912212427[[Duration ]])<= 3, SUMIF(Table13261720912212427[Type of Care], \"QI\", Table13261720912212427[[Duration ]]), 0))))> 90)","v":false}]
[null,null,"",null,null,null,null,{"$f":"IF( B112 > $D$83+14, SUMIFS($G$86:G112, $D$86:D112,\"Direct/Indirect/Clinical Administration\", $B$86:B112,\">\"&$D$83 + 14) + ((IF(SUMIF(Table13261720912212427[Type of Care], \"QI\", Table13261720912212427[[Duration ]])>= 4, 4,IF(SUMIF(Table13261720912212427[Type of Care], \"QI\", Table13261720912212427[[Duration ]])<= 3, SUMIF(Table13261720912212427[Type of Care], \"QI\", Table13261720912212427[[Duration ]]), 0))))  > 90, SUMIFS($G$86:G112, $D$86:D112,\"Direct/Indirect/Clinical Administration\",  $B$86:B112,\"<=\"&$D$83 + 14)+ ((IF(SUMIF(Table13261720912212427[Type of Care], \"QI\", Table13261720912212427[[Duration ]])>= 4, 4,IF(SUMIF(Table13261720912212427[Type of Care], \"QI\", Table13261720912212427[[Duration ]])<= 3, SUMIF(Table13261720912212427[Type of Care], \"QI\", Table13261720912212427[[Duration ]]), 0))))> 90)","v":false}]
[null,null,"",null,null,null,null,{"$f":"IF( B113 > $D$83+14, SUMIFS($G$86:G113, $D$86:D113,\"Direct/Indirect/Clinical Administration\", $B$86:B113,\">\"&$D$83 + 14) + ((IF(SUMIF(Table13261720912212427[Type of Care], \"QI\", Table13261720912212427[[Duration ]])>= 4, 4,IF(SUMIF(Table13261720912212427[Type of Care], \"QI\", Table13261720912212427[[Duration ]])<= 3, SUMIF(Table13261720912212427[Type of Care], \"QI\", Table13261720912212427[[Duration ]]), 0))))  > 90, SUMIFS($G$86:G113, $D$86:D113,\"Direct/Indirect/Clinical Administration\",  $B$86:B113,\"<=\"&$D$83 + 14)+ ((IF(SUMIF(Table13261720912212427[Type of Care], \"QI\", Table13261720912212427[[Duration ]])>= 4, 4,IF(SUMIF(Table13261720912212427[Type of Care], \"QI\", Table13261720912212427[[Duration ]])<= 3, SUMIF(Table13261720912212427[Type of Care], \"QI\", Table13261720912212427[[Duration ]]), 0))))> 90)","v":false}]
[null,null,"",null,null,null,null,{"$f":"IF( B114 > $D$83+14, SUMIFS($G$86:G114, $D$86:D114,\"Direct/Indirect/Clinical Administration\", $B$86:B114,\">\"&$D$83 + 14) + ((IF(SUMIF(Table13261720912212427[Type of Care], \"QI\", Table13261720912212427[[Duration ]])>= 4, 4,IF(SUMIF(Table13261720912212427[Type of Care], \"QI\", Table13261720912212427[[Duration ]])<= 3, SUMIF(Table13261720912212427[Type of Care], \"QI\", Table13261720912212427[[Duration ]]), 0))))  > 90, SUMIFS($G$86:G114, $D$86:D114,\"Direct/Indirect/Clinical Administration\",  $B$86:B114,\"<=\"&$D$83 + 14)+ ((IF(SUMIF(Table13261720912212427[Type of Care], \"QI\", Table13261720912212427[[Duration ]])>= 4, 4,IF(SUMIF(Table13261720912212427[Type of Care], \"QI\", Table13261720912212427[[Duration ]])<= 3, SUMIF(Table13261720912212427[Type of Care], \"QI\", Table13261720912212427[[Duration ]]), 0))))> 90)","v":false}]
[null,null,{"$f":"IF(B115=\"\", \"\", B115)","v":""},null,null,"Total Contract Hours",{"$f":"(SUMIF(Table13261720912212427[Type of Care], \"Direct/Indirect/Clinical Administration\",Table13261720912212427[[Duration ]]))","v":0},"CT3"]
[null,null,null,null,null,"Total Included QI Hours",{"$f":"(IF(SUMIF(Table13261720912212427[Type of Care], \"QI\", Table13261720912212427[[Duration ]])>= 4, 4,IF(SUMIF(Table13261720912212427[Type of Care], \"QI\", Table13261720912212427[[Duration ]])<= 3, SUMIF(Table13261720912212427[Type of Care], \"QI\", Table13261720912212427[[Duration ]]), 0)))","v":0},"QI3"]
[null,null,null,null,null,"Total Excluded Hours",{"$f":"G118+G119","v":0},"EX3"]
[null,null,null,null,null,"         Excluded Contract Hours",{"$f":"(SUMIF(Table13261720912212427[Type of Care], \"Third Party/Specialist FFS\",Table13261720912212427[[Duration ]])) + (SUMIF(Table13261720912212427[Type of Care], \"Break (>15 Minutes)\", Table13261720912212427[[Duration ]]))","v":0},"EXC3"]
[null,null,null,null,null,"      Excluded QI Hours",{"$f":"(SUMIF(Table13261720912212427[Type of Care], \"QI\", Table13261720912212427[[Duration ]]) - (IF(SUMIF(Table13261720912212427[Type of Care], \"QI\", Table13261720912212427[[Duration ]])>= 4, 4,IF(SUMIF(Table13261720912212427[Type of Care], \"QI\", Table13261720912212427[[Duration ]])<= 3, SUMIF(Table13261720912212427[Type of Care], \"QI\", Table13261720912212427[[Duration ]]), 0))))","v":0},"EXQI3"]
[null,null,{"$f":"IF(B120=\"\", \"\", B120)","v":""},null,null,"Hours Above 90hr/semi-monthly",{"$f":"  (IF(SUMIFS(Table13261720912212427[[Duration ]],Table13261720912212427[Date (YYYY-MM-DD)], \">\"&$D$83+14, Table13261720912212427[Type of Care], \"Direct/Indirect/Clinical Administration\")>= 90, (SUMIFS(Table13261720912212427[[Duration ]],Table13261720912212427[Date (YYYY-MM-DD)], \">\"&$D$83+14, Table13261720912212427[Type of Care], \"Direct/Indirect/Clinical Administration\")+ (IF(SUMIF(Table13261720912212427[Type of Care], \"QI\", Table13261720912212427[[Duration ]])>= 4, 4,IF(SUMIF(Table13261720912212427[Type of Care], \"QI\", Table13261720912212427[[Duration ]])<= 3, SUMIF(Table13261720912212427[Type of Care], \"QI\",Table13261720912212427[[Duration ]]), 0))) -90))) + (IF(SUMIFS(Table13261720912212427[[Duration ]],Table13261720912212427[Date (YYYY-MM-DD)], \"<=\"&$D$83+14, Table13261720912212427[Type of Care], \"Direct/Indirect/Clinical Administration\")>= 90, (SUMIFS(Table13261720912212427[[Duration ]],Table13261720912212427[Date (YYYY-MM-DD)], \"<=\"&$D$83+14, Table13261720912212427[Type of Care], \"Direct/Indirect/Clinical Administration\")+ (IF(SUMIF(Table13261720912212427[Type of Care], \"QI\", Table13261720912212427[[Duration ]])>= 4, 4,IF(SUMIF(Table13261720912212427[Type of Care], \"QI\", Table13261720912212427[[Duration ]])<= 3, SUMIF(Table13261720912212427[Type of Care], \"QI\",Table13261720912212427[[Duration ]]), 0))) -90)))","v":0},"A903"]

{"sheet":"Corrections for HA","index":9,"n_rows":5,"n_cols":8,"rows_kept":5,"cut":false,"hidden":false,"merged":[]}
[]
[null,"Corrections "]
[null,"Please inform any corrections made for hours from perviously submitted quarter reports."]
[]
[null,"Practitioner Number","Practitioner Name","Hours (-/+)","Type of Care","Month","Quarter","Reason/Notes"]